{"text_format":"1","workbook":"xlsx","n_sheets":15,"sheets":["Prompt","S100","S104","S117","S200","S300","S400","S500","S600","S605","S700","S800","S900","Enviar","Ubigeo_UGEL"],"not_rendered":{"charts":0,"images":9,"macros":1,"external_links":0,"defined_names":23,"comments":1,"pivot_tables":0},"unopened":[],"bounds":{"document_bytes":16777216,"sheet_cells":100000,"rows_first":2000,"rows_last":500,"rows_between":2000,"halvings":0,"cell_chars":16384,"cell_head_chars":4096},"cells_cut":0,"cells_raw":0,"read":"whole","date_system":"1900"}

{"sheet":"Prompt","index":0,"n_rows":79,"n_cols":4,"rows_kept":79,"cut":false,"hidden":true,"merged":[[78,1,79,8],[1,3,2,5],[4,1,6,8],[9,1,10,8],[43,1,44,8]]}
[]
[null,null,null,"¡ATENCIÓN!"]
[]
[]
[null,"Para hacer uso de las funcionalidades de esta Cédula Electrónica debe habilitar macros"]
[]
[]
[]
[]
[null,"Si utiliza Excel 2013 siga el siguiente procedimiento:"]
[]
[]
[]
[]
[]
[]
[]
[]
[]
[]
[]
[]
[]
[]
[]
[]
[]
[]
[]
[]
[]
[]
[]
[]
[]
[]
[]
[]
[]
[]
[]
[]
[]
[null,"Si utiliza Excel 2007 siga el siguiente procedimiento:"]
[]
[]
[]
[]
[]
[]
[]
[]
[]
[]
[]
[]
[]
[]
[]
[]
[]
[]
[]
[]
[]
[]
[]
[]
[]
[]
[]
[]
[]
[]
[]
[]
[]
[]
[null,"Si utiliza Excel 2000, 2002, 2003 siga el siguiente procedimiento:"]

{"sheet":"S100","index":1,"n_rows":1660,"n_cols":46,"rows_kept":1660,"cut":false,"hidden":false,"merged":[[51,9,51,21],[46,9,48,13],[116,35,116,36],[117,35,117,36],[118,35,118,36],[112,24,112,29],[114,20,114,23],[115,20,115,23],[111,37,111,38],[91,17,91,19],[91,36,91,40],[92,13,92,16],[92,17,92,19],[92,36,92,40],[90,9,90,12],[90,13,90,16],[90,20,90,26],[75,30,75,32],[84,31,84,35],[79,31,79,36],[81,31,81,38],[84,10,84,16],[91,27,91,35],[92,27,92,35],[111,39,111,40],[112,37,112,38],[113,37,113,38],[114,37,114,38],[115,37,115,38],[116,37,116,38],[117,37,117,38],[118,37,118,38],[26,11,26,34],[30,30,30,31],[100,36,100,40],[101,36,101,40],[97,27,97,35],[97,36,97,40],[90,17,90,19],[95,36,95,40],[90,36,90,40],[97,17,97,19],[91,20,91,26],[92,20,92,26],[93,20,93,26],[94,20,94,26],[95,20,95,26],[94,36,94,40],[119,39,119,40],[93,36,93,40],[102,27,102,35],[98,27,98,35],[99,27,99,35],[100,27,100,35],[101,27,101,35],[119,35,119,36],[98,36,98,40],[99,36,99,40],[113,24,113,29],[110,30,111,34],[114,24,114,29],[116,30,116,34],[115,30,115,34],[115,39,115,40],[116,39,116,40],[117,39,117,40],[101,20,101,26],[102,36,102,40],[119,20,119,23],[93,27,93,35],[94,27,94,35],[95,27,95,35],[1,36,1,39],[2,14,2,29],[2,36,3,39],[3,10,3,33],[1,14,1,29],[5,23,5,28],[14,30,14,32],[18,30,18,39],[22,11,22,34],[10,5,10,40],[16,10,16,18],[17,10,17,18],[14,10,14,12],[18,10,18,18],[18,21,19,28],[122,24,122,29],[120,24,120,29],[96,20,96,26],[97,20,97,26],[98,20,98,26],[99,20,99,26],[96,36,96,40],[102,20,102,26],[117,30,117,34],[118,30,118,34],[119,30,119,34],[120,30,120,34],[121,30,121,34],[116,24,116,29],[118,24,118,29],[119,24,119,29],[111,24,111,29],[114,30,114,34],[120,39,120,40],[121,39,121,40],[121,24,121,29],[115,24,115,29],[117,24,117,29],[96,27,96,35],[40,7,40,39],[36,27,36,30],[36,37,36,39],[37,27,37,30],[37,21,37,22],[37,31,37,34],[36,35,36,36],[37,35,37,36],[39,37,39,38],[37,25,37,26],[37,37,37,39],[91,9,91,12],[92,9,92,12],[91,13,91,16],[77,30,77,32],[75,36,75,40],[77,36,77,40],[102,9,102,12],[98,9,98,12],[99,9,99,12],[100,9,100,12],[101,9,101,12],[93,13,93,16],[93,17,93,19],[102,7,102,8],[102,13,102,16],[96,7,96,8],[96,13,96,16],[96,17,96,19],[100,7,100,8],[101,7,101,8],[93,9,93,12],[94,9,94,12],[94,17,94,19],[95,7,95,8],[97,7,97,8],[97,13,97,16],[110,7,111,8],[102,17,102,19],[98,13,98,16],[100,20,100,26],[111,20,111,23],[79,18,80,20],[123,7,123,8],[129,7,129,8],[122,7,122,8],[119,7,119,8],[120,10,120,19],[121,10,121,19],[122,10,122,19],[120,20,120,23],[121,20,121,23],[122,20,122,23],[118,20,118,23],[118,10,118,19],[118,7,118,8],[117,10,117,19],[117,20,117,23],[94,7,94,8],[94,13,94,16],[115,7,115,8],[110,9,111,9],[112,7,112,8],[123,20,123,23],[123,10,123,19],[111,35,111,36],[36,31,36,34],[36,23,36,24],[36,25,36,26],[37,7,37,20],[37,23,37,24],[36,7,36,20],[117,7,117,8],[113,20,113,23],[113,7,113,8],[116,20,116,23],[116,10,116,19],[114,10,114,19],[112,20,112,23],[116,7,116,8],[91,7,91,8],[92,7,92,8],[98,7,98,8],[90,7,90,8],[120,7,120,8],[121,7,121,8],[100,13,100,16],[95,9,95,12],[96,9,96,12],[97,9,97,12],[95,13,95,16],[95,17,95,19],[93,7,93,8],[131,7,131,8],[129,9,129,11],[130,9,130,11],[131,9,131,11],[130,7,130,8],[100,17,100,19],[101,13,101,16],[101,17,101,19],[113,10,113,19],[112,10,112,19],[114,7,114,8],[115,10,115,19],[98,17,98,19],[99,7,99,8],[99,13,99,16],[99,17,99,19],[119,10,119,19],[132,7,132,8],[128,9,128,11],[133,7,133,8],[134,7,134,8],[128,35,128,45],[128,32,128,34],[128,7,128,8],[128,29,128,31],[129,32,129,34],[130,29,130,31],[128,12,128,26],[129,29,129,31],[123,35,123,36],[123,30,123,34],[122,30,122,34],[123,24,123,29],[122,35,122,36],[121,35,121,36],[120,35,120,36],[123,37,123,38],[122,37,122,38],[119,37,119,38],[120,37,120,38],[139,9,139,11],[139,32,139,34],[140,9,140,11],[140,32,140,34],[138,9,138,11],[130,32,130,34],[138,32,138,34],[136,32,136,34],[134,32,134,34],[135,32,135,34],[135,9,135,11],[136,9,136,11],[137,32,137,34],[137,9,137,11],[131,32,131,34],[132,32,132,34],[133,32,133,34],[133,9,133,11],[134,9,134,11],[132,9,132,11],[153,7,153,8],[153,9,153,11],[153,29,153,31],[153,32,153,34],[148,9,148,11],[148,32,148,34],[149,9,149,11],[149,32,149,34],[146,9,146,11],[146,32,146,34],[147,9,147,11],[147,32,147,34],[147,29,147,31],[148,29,148,31],[149,29,149,31],[152,7,152,8],[152,9,152,11],[152,29,152,31],[152,32,152,34],[150,9,150,11],[150,32,150,34],[151,9,151,11],[151,32,151,34],[150,29,150,31],[144,7,144,8],[145,7,145,8],[146,7,146,8],[147,7,147,8],[148,7,148,8],[149,7,149,8],[150,7,150,8],[151,7,151,8],[135,29,135,31],[136,29,136,31],[137,29,137,31],[138,29,138,31],[139,29,139,31],[140,29,140,31],[141,9,141,11],[144,9,144,11],[145,9,145,11],[142,9,142,11],[143,9,143,11],[141,29,141,31],[142,29,142,31],[143,29,143,31],[144,29,144,31],[145,29,145,31],[135,7,135,8],[136,7,136,8],[137,7,137,8],[138,7,138,8],[139,7,139,8],[140,7,140,8],[141,7,141,8],[142,7,142,8],[143,7,143,8],[121,37,121,38],[123,39,123,40],[122,39,122,40],[112,39,112,40],[113,39,113,40],[114,39,114,40],[151,29,151,31],[141,32,141,34],[144,32,144,34],[145,32,145,34],[142,32,142,34],[143,32,143,34],[131,29,131,31],[132,29,132,31],[133,29,133,31],[134,29,134,31],[146,29,146,31],[118,39,118,40],[112,30,112,34],[113,30,113,34],[112,35,112,36],[113,35,113,36],[114,35,114,36],[115,35,115,36]]}
[]
[null,null,null,null,null,null,null,null,null,null,null,null,null,null,"CENSO EDUCATIVO 2024",null,null,null,null,null,null,null,null,null,null,null,null,null,null,null,null,null,null,null,null,null,"CÉDULA"]
[null,null,null,null,null,null,null,null,null,null,null,null,null,null,"LOCAL EDUCATIVO",null,null,null,null,null,null,null,null,null,null,null,null,null,null,null,null,null,null,null,null,null,11]
[null,null,null,null,null,"Versión :",null,"GA-3.2",null,null,"  FICHA UNIFICADA DE INFRAESTRUCTURA EDUCATIVA"]
[]
[null,null,null,null,null,null,null,null,null,null,null,null,null,null,null,"CÓDIGO DEL LOCAL EDUCATIVO :"]
[]
[]
[]
[]
[null,null,null,null,null,"UBICACIÓN E IDENTIFICACIÓN DEL LOCAL EDUCATIVO"]
[]
[null,null,null,null,null,null,"UBICACIÓN DEL LOCAL EDUCATIVO"]
[]
[null,null,null,null,null,null,"CÓDIGO DE UBIGEO",null,null,null,null,null,null,null,null,null,null,null,null,null,null,"CÓDIGO DEPENDENCIA ADMINISTRATIVA :"]
[]
[null,null,null,null,null,null,"1. DEPARTAMENTO :",null,null,null,{"$f":"IF(ISERROR(VLOOKUP(K15,UBIGEO,2,FALSE)),\"\",VLOOKUP(K15,UBIGEO,2,FALSE))","v":""},null,null,null,null,null,null,null,null,null,null,"4. DEPENDENCIA ADMINISTRATIVA:",null,null,null,null,null,null,null,null,"","GRE",null,"","DRE",null,null,"UGEL"]
[null,null,null,null,null,null,"2. PROVINCIA :",null,null,null,{"$f":"IF(ISERROR(VLOOKUP(K15,UBIGEO,3,FALSE)),\"\",VLOOKUP(K15,UBIGEO,3,FALSE))","v":""}]
[null,null,null,null,null,null,"3. DISTRITO :",null,null,null,{"$f":"IF(ISERROR(VLOOKUP(K15,UBIGEO,4,FALSE)),\"\",VLOOKUP(K15,UBIGEO,4,FALSE))","v":""},null,null,null,null,null,null,null,null,null,"","5. NOMBRE DE DEPENDENCIA ADMINISTRATIVA:",null,null,null,null,null,null,null,null,{"$f":"IF(ISERROR(VLOOKUP(AE15,UGEL,2,FALSE)),\"\",VLOOKUP(AE15,UGEL,2,FALSE))","v":""}]
[]
[]
[]
[null,null,null,null,null,null,"6. CENTRO POBLADO:",null,null,null,null,null,null,null,null,null,null,null,null,null,null,null,null,null,null,null,null,null,null,null,null,null,null,null,null,null,null,"Longitud",null,{"$f":"LEN(TRIM(L23))","v":0}]
[]
[null,null,null,null,null,null,"Tipo de centro poblado:",null,null,null,null,"","Caserío",null,null,"","Pueblo",null,"","Villa",null,"Ciudad",null,"","Comunidad",null,null,"","Anexo"]
[]
[null,null,null,null,null,null,"7. NÚCLEO URBANO:",null,null,null,null,null,null,null,null,null,null,null,null,null,null,null,null,null,null,null,null,null,null,null,null,null,null,null,null,null,null,"Longitud",null,{"$f":"LEN(TRIM(L27))","v":0}]
[null,null,null,null,null,null,null,null,null,""]
[null,null,null,null,null,null,"Tipo de núcleo urbano:",null,null,null,null,"","Cercado",null,null,null,"","Urbanización",null,null,"","Barrio",null,"","Complejo Habitacional",null,null,null,null,"","Unidad vecinal",null,null,null,"","Asociación de  Vivienda"]
[]
[null,null,null,null,null,null,null,null,null,null,null,"","Coop. Vivienda",null,null,null,"","Ciudadela",null,null,"","AA.HH.",null,null,"Pueblo Joven",null,null,null,null,"","Otro"]
[null,null,null,null,null,null,null,null,null,""]
[null,null,null,null,null,null,"8. DIRECCIÓN PRINCIPAL DEL LOCAL EDUCATIVO"]
[]
[null,null,null,null,null,null,"Tipo de vía:",null,null,null,"Avenida",null,null,"Calle",null,null,"Jirón",null,null,"Pasaje",null,"Autopista",null,"Carretera",null,null,null,"Alameda",null,null,"Parque",null,null,"Otro"]
[]
[null,null,null,null,null,null,null,"Nombre de la vía",null,null,null,null,null,null,null,null,null,null,null,null,null,"N° de puerta",null,"Mz.",null,"Lote",null,"Sector",null,null,null,"Zona",null,null,null,"Etapa",null,"Otro"]
[null,null,null,null,null,null,null,""]
[]
[null,null,null,null,null,null,"9. REFERENCIA DE LA DIRECCIÓN DEL LOCAL EDUCATIVO  (Texto de 200 caracteres)",null,null,null,null,null,null,null,null,null,null,null,null,null,null,null,null,null,null,null,null,null,null,"Número de caracteres registrados :",null,null,null,null,null,null,null,{"$f":"LEN(TRIM(H41))","v":0}]
[null,null,null,null,null,null,null,""]
[null,null,null,null,null,null,null,"Ejemplos: 1. A la altura de la cuadra 34 de la Av. Aviación. 2. A una cuadra de la Plaza de Armas del distrito. 3. Frente al Hospital El Carmen."]
[null,null,null,null,null,null,null,"4. Entre los centros poblados de San Pedro, Accos y Lares. 5. Al pie de la carretera, aprox. 200m del desvío al poblado de Lucre."]
[]
[null,null,null,null,null,null,"10. PUNTOS DE GEORREFERENCIACIÓN",null,null,null,null,null,null,null,null,null,null,null,null,null,null,null,null,null,"11. CLIMA"]
[]
[null,null,null,null,null,null,"LATITUD",null,":","Utilice la APP GeoLOCALES censo",null,null,null,null,null,null,null,null,null,null,null,null,null,null,null,""," 1. Desértico costero / marino",null,null,null,null,null,null,null,""," 6. Nevado"]
[null,null,null,null,null,null,"LONGITUD",null,":",null,null,null,null,null,null,null,null,null,null,null,null,null,null,null,null,null," 2. Desértico",null,null,null,null,null,null,null,""," 7. Ceja de montaña"]
[null,null,null,null,null,null,"ALTITUD",null,":",null,null,null,null,null,null,null,null,null,null,null,null,null,null,null,null,""," 3. Interandino bajo",null,null,null,null,null,null,null,""," 8. Subtropical húmedo"]
[null,null,null,null,null,null,null,null,null,null,null,null,null,null,null,null,null,null,null,null,null,null,null,null,null,""," 4. Mesoandino",null,null,null,null,null,null,null,""," 9. Tropical húmedo"]
[null,null,null,null,null,null,null,null,null,null,null,null,null,null,null,null,null,null,null,null,null,null,null,null,null,""," 5. Altoandino"]
[null,null,null,null,null,null,null,null,"NOTA:","Las coordenadas de ubicación del Local Educativo deben obtenerse únicamente mediante el uso del aplicativo móvil de georreferenciación para celulares (Android) llamado “GeoLOCALES”"]
[null,null,null,null,null,null,null,null,null,"Videos tutoriales y más recursos en: ",null,null,null,null,null,null,null,"https://goo.su/XByYWF",null,null,null,null,null,null,null,"NOTA: ",null,"Para más detalle revise en el manual del informante."]
[null,null,null,null,null,null,null,null,"Descargas :",null,"https://goo.su/myVuPki",null,null,null,null,null,"o","https://escale.minedu.gob.pe/"]
[]
["Salto construcción",null,null,null,null,null,"12. SOBRE LA CONTRUCCIÓN Y/O RECONSTRUCCIÓN DEL LOCAL EDUCATIVO"]
[null,null,null,null,null,null,"12.1. LOS SERVICIOS EDUCATIVOS AUTORIZADOS A FUNCIONAR EN ESTE LOCAL",null,null,null,null,null,null,null,null,null,null,null,null,null,null,null,null,"12.3. ¿POR QUÉ ALGUNO(S) O TODOS LOS SERVICIOS EDUCATIVOS VIENEN OPERANDO"]
[null,null,null,null,null,null,null,"EDUCATIVO, SEGÚN “ESCALE” (CÓDIGO DE LOCAL), ¿SE ENCUENTRAN OPERANDO",null,null,null,null,null,null,null,null,null,null,null,null,null,null,null,null,"EN OTRO LUGAR O EN UNA INFRAESTRUCTURA DE OTRO ESPACIO?"]
[null,null,null,null,null,null,null,"EN ALGÚN OTRO LUGAR O EN LA INFRAESTRUCTURA DE OTRO ESPACIO, AL"]
[null,null,null,null,null,null,null,"MOMENTO DE LA APLICACION DEL CENSO EDUCATIVO?",null,null,null,null,null,null,null,null,null,null,null,null,null,null,null,null,null,null,"1. La infraestructura se encuentra en construcción/reconstrucción"]
["TABLA 03 - Modalidad"]
["01: EIB",null,null,null,null,null,null,"","Sí, todos",null,null,"Sí, algunos",null,null,"","No, ninguno",null,null,null,"Pase a la sección 100",null,null,null,null,null,null,null,null,"","1.1. Total, de todo(s)",null,null,null,null,null,null,"Pase a la pregunta 12.4."]
["02: JEC",null,null,null,null,null,null,null,null,null,null,null,null,null,null,null,null,null,null,null,null,null,null,null,null,null,null,null,""]
["03: COAR",null,null,null,null,null,"12.2. SEGÚN SU RESPUESTA ANTERIOR, ¿EN QUÉ OTRO LUGAR O INFRAESTRUCTURA",null,null,null,null,null,null,null,null,null,null,null,null,null,null,null,null,null,null,null,null,null,"","1.2. Parcial",null,null,null,null,"Pase a la pregunta 12.5."]
["04: SEC.Tutorial",null,null,null,null,null,null,"DE OTRO ESPACIO, SE ENCUENTRA(N) OPERANDO EL (LOS) SERVICIO(S)"]
["05: SEC.Formación Técnica",null,null,null,null,null,null,"EDUCATIVO(S) ACTUALMENTE?",null,null,null,null,null,null,null,null,null,null,null,null,null,null,null,null,null,"","2. El local educativo tiene terreno, pero no cuenta con infraestructura"]
["06: SEC.RES.Estudiantil",null,null,null,null,null,null,null,null,null,null,null,null,null,null,null,null,null,null,null,null,null,null,null,null,"","3. El local educativo no cuenta con infraestructura ni terreno",null,null,null,null,null,null,null,null,null,null,null,null,null,null,""]
["07: SEC.Alternancia",null,null,null,null,null,{"$f":"CONCATENATE(H62,K62)","v":""},"1. Local Educativo",null,null,null,null,null,null,null,null,null,null,null,null,null,null,null,null,null,"","4. Insuficientes ambientes",null,null,null,null,null,null,null,null,null,null,null,null,null,null,""]
["08: ETP",null,null,null,null,null,null,null,null,null,null,null,null,null,null,null,null,null,null,null,null,null,null,null,null,"","5. La infraestructura se encuentra concluida pero, en proceso de recepción",null,null,null,null,null,null,null,null,null,null,null,null,null,null,""]
["09: EDUC.SUP.Tecnológica",null,null,null,null,null,null,null,"1.1 Otro Local educativo",null,null,null,null,"¿Todos los niveles operan en un solo local educativo?",null,null,null,null,null,null,null,null,null,null,null,null,null,null,null,null,null,null,null,null,null,null,null,null,null,null,null,""]
["10: Tecnológico de Excelencia",null,null,null,null,null,null,null,null,null,null,null,null,null,null,null,null,null,null,null,null,null,null,null,null,null,null,null,null,null,null,null,null,null,null,null,null,null,null,null,null,""]
["11: EDUC.SUP.Pedagógica",null,null,null,null,null,null,null,null,null,"Sí",null,null,"Código de local unico",null,null,null,null,":",null,null,null,null,"12.4. SOBRE EL LOCAL EDUCATIVO CUYA INFRAESTRUCTURA SE ENCUENTRA EN",null,null,null,null,null,null,null,null,null,null,null,null,null,null,null,null,null,""]
["12: NO Corresponde",null,null,null,null,null,null,null,null,null,null,null,null,null,null,null,null,null,null,null,null,null,null,null,"CONSTRUCCIÓN/RECONSTRUCCIÓN “TOTAL”, COMPLETE LA SIGUIENTE TABLA",null,null,null,null,null,null,null,null,null,null,null,null,null,null,null,null,""]
[null,null,null,null,null,null,null,null,null,null,null,null,null,"Código de local 1",null,null,null,null,":",null,null,null,null,null,"CON INFORMACIÓN SOBRE LA OBRA:",null,null,null,null,null,null,null,null,null,null,null,null,null,null,null,null,""]
[null,null,null,null,null,null,null,null,null,null,null,null,null,"Código de local 2 ",null,null,null,null,":",null,null,null,null,null,null,null,null,null,null,null,null,null,null,null,null,null,null,null,null,null,null,""]
["TABLA  - Entidad",null,null,null,null,null,null,null,null,null,"No",null,null,"Código de local 3",null,null,null,null,":",null,null,null,null,null,"¿Cuándo inicio?",null,null,null,null,"Año  ",null,null,null,null,"Mes"]
["1: Minedu",null,null,null,null,null,null,null,null,null,null,null,null,"Código de local 4",null,null,null,null,":"]
["2: Gob.regional",null,null,null,null,null,null,null,null,null,null,null,null,"Código de local 5",null,null,null,null,":",null,null,null,null,null,"¿Cuándo concluirá?",null,null,null,null,"Año  ",null,null,null,null,"Mes"]
["3: Gob.Local",null,null,null,null,null,null,null,null,null,null,null,null,null,null,{"$f":"CONCATENATE(T74,T75,T76,T77,T78)","v":""}]
["4: Otro sector del estado",null,null,null,null,null,{"$f":"CONCATENATE(H82,H83,H84,H85)","v":""},"2. Espacio diferente a un local educativo",null,null,null,null,null,null,null,null,null,null,"Seleccione una opcion:",null,null,null,null,null,"Entidad que financia la Intervención"]
["5: Empresa privada"]
["6: Otro",null,null,null,null,null,null,null,"2.1. Vivienda privada",null,null,null,null,null,null,null,null,null,"","","",null,null,null,null,null,null,{"$f":"IF(OR(LEFT(AF80,2)=\"04\",LEFT(AF80,2)=\"06\"),\"X\",\"\")","v":""},"Especifique",null,null,""]
[null,null,null,null,null,null,null,null,"2.2. Parque/estadio/coliseo",null,null,null,null,null,null,null,null,null,"",null,""]
[null,null,null,null,null,null,null,null,"2.3. Infraestructura nueva sin código de local",null,null,null,null,null,null,null,null,null,"",null,""]
[null,null,null,null,null,null,null,null,"2.4. Otro",null,"",null,null,null,null,null,null,null,"",null,"",null,null,null,"Código Único de Inversión (CUI)",null,null,null,null,null,null,""]
[]
[]
[null,null,null,null,null,"12.5. SOBRE EL LOCAL EDUCATIVO CUYA INFRAESTRUCTURA SE ENCUENTRA EN CONSTRUCCIÓN/RECONSTRUCCIÓN DE MANERA “PARCIAL”, COMPLETE LA SIGUIENTE"]
[null,null,null,null,null,null,"TABLA, CON INFORMACIÓN SOBRE LA(S) OBRA(S), Y CONTINÚE CON EL LLENADO REGULAR DE LA CÉDULA CENSAL."]
[]
[null,null,null,null,null,{"$f":"SUM(F92:F103)","v":0},"Nº","Código Modular",null,"Se encuentra\nen etapa de construcción",null,null,null,"Fecha de Inicio",null,null,null,"Fecha de Término",null,null,"Entidad que financia la Intervención",null,null,null,null,null,null,null,null,null,"Especifique",null,null,null,null,null,"Código Único de Inversión (CUI) de la Intervención"]
[{"$f":"LEFT(Y113,1)","v":""},{"$f":"COUNTIF($A$92:$A$103,\"A\")","v":0},"Inicial",{"$f":"LEFT(Y113,2)","v":""},null,{"$f":"IF(H92<>\"\",1,0)","v":0},1,"",null,"",null,null,null,"",null,null,null,"",null,null,"",null,null,null,null,null,null,"",null,null,null,null,null,null,null,null,""]
["",{"$f":"COUNTIF($A$92:$A$103,\"B\")","v":0},"Primaria","",null,{"$f":"IF(H93<>\"\",1,0)","v":0},2,"",null,"",null,null,null,"",null,null,null,"",null,null,"",null,null,null,null,null,null,"",null,null,null,null,null,null,null,null,""]
["",{"$f":"COUNTIF($A$92:$A$103,\"F\")","v":0},"Secundaria","",null,0,3,"",null,"",null,null,null,"",null,null,null,"",null,null,"",null,null,null,null,null,null,"",null,null,null,null,null,null,null,null,""]
["",{"$f":"COUNTIF($A$92:$A$103,\"E\")","v":0},"EBE","",null,0,4,"",null,"",null,null,null,"",null,null,null,"",null,null,"",null,null,null,null,null,null,"",null,null,null,null,null,null,null,null,""]
["",{"$f":"COUNTIF($A$92:$A$103,\"D\")","v":0},"EBA","",null,0,5,"",null,"",null,null,null,"",null,null,null,"",null,null,"",null,null,null,null,null,null,"",null,null,null,null,null,null,null,null,""]
["",{"$f":"COUNTIF($A$92:$A$103,\"L\")","v":0},"ETP","",null,0,6,"",null,"",null,null,null,"",null,null,null,"",null,null,"",null,null,null,null,null,null,"",null,null,null,null,null,null,null,null,""]
["",{"$f":"COUNTIF($A$92:$A$103,\"K\")","v":0},"ISP","",null,0,7,"",null,"",null,null,null,"",null,null,null,"",null,null,"",null,null,null,null,null,null,"",null,null,null,null,null,null,null,null,""]
["",{"$f":"COUNTIF($A$92:$A$103,\"T\")","v":0},"IST","",null,0,8,"",null,"",null,null,null,"",null,null,null,"",null,null,"",null,null,null,null,null,null,"",null,null,null,null,null,null,null,null,""]
["",{"$f":"COUNTIF($A$92:$A$103,\"M\")","v":0},"ESFA","",null,0,9,"",null,"",null,null,null,"",null,null,null,"",null,null,"",null,null,null,null,null,null,"",null,null,null,null,null,null,null,null,""]
["",{"$f":"COUNTIF($A$92:$A$103,\"P\")","v":0},"EESP","",null,0,10,"",null,"",null,null,null,"",null,null,null,"",null,null,"",null,null,null,null,null,null,"",null,null,null,null,null,null,null,null,""]
["",{"$f":"COUNTIF($A$92:$A$103,\"S\")","v":0},"EEST","",null,0,11,"",null,"",null,null,null,"",null,null,null,"",null,null,"",null,null,null,null,null,null,"",null,null,null,null,null,null,null,null,""]
["",null,null,"",null,0,12,"",null,"",null,null,null,"",null,null,null,"",null,null,"",null,null,null,null,null,null,"",null,null,null,null,null,null,null,null,""]
["SUPERIOR",{"$f":"SUM(B98:B102)","v":0},{"$f":"IF(B104>0,\"X\",\"\")","v":""}]
[]
[null,null,null,null,null,"100. CARACTERÍSTICAS DEL LOCAL EDUCATIVO"]
[]
[null,null,null,null,null,"A. SERVICIOS NIVELES/EDUCATIVOS PRESTADOS EN EL LOCAL EDUCATIVO"]
[null,null,null,null,null,null,"101. SERVICIOS NIVELES/EDUCATIVOS QUE FUNCIONAN EN EL LOCAL EDUCATIVO"]
[null,null,null,null,null,null,"Registre en primer lugar el código modular del servicio educativo que está llenando esta cédula."]
[null,null,null,null,null,null,{"$f":"SUM(D113:D124)","v":0},"(1)\nCódigo modular",null,"Anexo",null,null,null,null,null,null,null,null,null,null,null,"(4)",null,null,null,null,"(5)",null,null,null,"Modelo de servicio educativo",null,null,null,null,null,null,"Sobre Residencia Estudiantil (RE)"]
["GESTIÓN",{"$f":"IF(B113>0,1,IF(AND(B113=0,B116>0),3,9))","v":9},null,{"$f":"SUM(D113:D124)","v":0},null,null,"Nº",null,null,null,"Nombre del servicio/nivel educativo",null,null,null,null,null,null,null,null,null,"Gestión",null,null,null,"Nivel y/o modalidad",null,null,null,null,null,null,null,null,null,null,"¿Cuenta con RE? ",null,"Cantidad de alumnos en la RE",null,"¿La RE está\nen el local principal\nde la IE?",null,"Señalar la distancia en metros","¿Los ambientes de la RE se encuentran en los terrenos propios del local?","¿Cuenta con un Local Adicional?","¿Tiene Código de Local Educativo?","Código de Local Educativo"]
[{"$f":"LEFT(U113,2)","v":""},{"$f":"IF(OR(B114>0,B115>0),1,0)","v":0},null,{"$f":"IF(H113<>\"\",1,0)","v":0},null,null,1,null,null,null,null,null,null,null,null,null,null,null,null,null,null,null,null,null,null,null,null,null,null,null,null,null,null,null,null,null,null,"",null,"",null,"","","","",""]
["",{"$f":"COUNTIF($A$113:$A$124,\"01\")","v":0},null,{"$f":"IF(H114<>\"\",1,0)","v":0},null,null,2,null,null,null,null,null,null,null,null,null,null,null,null,null,null,null,null,null,null,null,null,null,null,null,null,null,null,null,null,null,null,"",null,"",null,"","","","",""]
["",{"$f":"COUNTIF($A$113:$A$124,\"02\")","v":0},null,0,null,null,3]
["",{"$f":"IF(B117>0,3,0)","v":0},null,0,null,null,4]
["",{"$f":"COUNTIF($A$113:$A$124,\"03\")","v":0},null,0,null,null,5]
["",null,null,0,null,null,6]
["",null,null,0,null,null,7]
["",null,null,0,null,null,8]
["",null,null,0,null,null,9]
["",null,null,0,null,null,10]
["",null,null,0,null,null,11]
["",null,null,0,null,null,12]
[null,null,null,null,null,null,null,null,null,null,null,null,null,null,null,null,null,null,null,null,null,null,null,null,null,null,null,null,null,null,null,null,null,null,null,null,null,null,null,null,null,null,null,{"$f":"COUNTIF(AR113:AR124,\"SI\")+COUNTIF(AR113:AR124,\"NO\")","v":0}]
[]
[null,null,null,null,null,null,"102. LISTADO DE CARRERAS O PROGRAMAS OFRECIDOS EN ESTE LOCAL EDUCATIVO POR EL INSTITUTO DE EDUCACIÓN SUPERIOR"]
[]
[null,null,null,null,null,null,"Nº","Nivel de Educación Superior",null,"Código de Carrera",null,null,"Nombre de la carrera de Educación Superior No Universitaria",null,null,null,null,null,null,null,null,null,null,null,null,null,null,null,"Nº","Nivel de Educación Superior",null,null,"Código de Carrera",null,null,"Nombre de la carrera de Educación Superior No Universitaria"]
[{"$f":"IF(OR(H130<>\"\",J130<>\"\",M130<>\"\"),1,0)","v":0},{"$f":"IF(OR(AD130<>\"\",AG130<>\"\",AJ130<>\"\"),1,0)","v":0},{"$f":"IF(AND(H130=\"\",J130=\"\",AD130=\"\",AG130=\"\"),1,0)","v":1},null,null,null,"01",null,null,null,null,null,{"$f":"IF(ISERROR(VLOOKUP(J130,carreras,2,FALSE)),\"\",VLOOKUP(J130,carreras,2,FALSE))","v":""},null,null,null,null,null,null,null,null,null,null,null,null,null,null,null,26,null,null,null,null,null,null,{"$f":"IF(ISERROR(VLOOKUP(AG130,carreras,2,FALSE)),\"\",VLOOKUP(AG130,carreras,2,FALSE))","v":""}]
[{"$f":"IF(OR(H131<>\"\",J131<>\"\",M131<>\"\"),1,0)","v":0},0,1,null,null,null,"02",null,null,null,null,null,"",null,null,null,null,null,null,null,null,null,null,null,null,null,null,null,27,null,null,null,null,null,null,""]
[0,0,1,null,null,null,"03",null,null,null,null,null,"",null,null,null,null,null,null,null,null,null,null,null,null,null,null,null,28,null,null,null,null,null,null,""]
[0,0,1,null,null,null,"04",null,null,null,null,null,"",null,null,null,null,null,null,null,null,null,null,null,null,null,null,null,29,null,null,null,null,null,null,""]
[0,0,1,null,null,null,"05",null,null,null,null,null,"",null,null,null,null,null,null,null,null,null,null,null,null,null,null,null,30,null,null,null,null,null,null,""]
[0,0,1,null,null,null,"06",null,null,null,null,null,"",null,null,null,null,null,null,null,null,null,null,null,null,null,null,null,31,null,null,null,null,null,null,""]
[0,0,1,null,null,null,"07",null,null,null,null,null,"",null,null,null,null,null,null,null,null,null,null,null,null,null,null,null,32,null,null,null,null,null,null,""]
[0,0,1,null,null,null,"08",null,null,null,null,null,"",null,null,null,null,null,null,null,null,null,null,null,null,null,null,null,33,null,null,null,null,null,null,""]
[0,0,1,null,null,null,"09",null,null,null,null,null,"",null,null,null,null,null,null,null,null,null,null,null,null,null,null,null,34,null,null,null,null,null,null,""]
[0,0,1,null,null,null,10,null,null,null,null,null,"",null,null,null,null,null,null,null,null,null,null,null,null,null,null,null,35,null,null,null,null,null,null,""]
[{"$f":"IF(OR(H140<>\"\",J140<>\"\",M140<>\"\"),1,0)","v":0},0,1,null,null,null,11,null,null,null,null,null,{"$f":"IF(ISERROR(VLOOKUP(J140,carreras,2,FALSE)),\"\",VLOOKUP(J140,carreras,2,FALSE))","v":""},null,null,null,null,null,null,null,null,null,null,null,null,null,null,null,36,null,null,null,null,null,null,""]
[0,0,1,null,null,null,12,null,null,null,null,null,"",null,null,null,null,null,null,null,null,null,null,null,null,null,null,null,37,null,null,null,null,null,null,""]
[0,0,1,null,null,null,13,null,null,null,null,null,"",null,null,null,null,null,null,null,null,null,null,null,null,null,null,null,38,null,null,null,null,null,null,""]
[0,0,1,null,null,null,14,null,null,null,null,null,"",null,null,null,null,null,null,null,null,null,null,null,null,null,null,null,39,null,null,null,null,null,null,""]
[0,0,1,null,null,null,15,null,null,null,null,null,"",null,null,null,null,null,null,null,null,null,null,null,null,null,null,null,40,null,null,null,null,null,null,""]
[0,0,1,null,null,null,16,null,null,null,null,null,"",null,null,null,null,null,null,null,null,null,null,null,null,null,null,null,41,null,null,null,null,null,null,""]
[0,0,1,null,null,null,17,null,null,null,null,null,"",null,null,null,null,null,null,null,null,null,null,null,null,null,null,null,42,null,null,null,null,null,null,""]
[0,0,1,null,null,null,18,null,null,null,null,null,"",null,null,null,null,null,null,null,null,null,null,null,null,null,null,null,43,null,null,null,null,null,null,""]
[0,0,1,null,null,null,10,null,null,null,null,null,"",null,null,null,null,null,null,null,null,null,null,null,null,null,null,null,44,null,null,null,null,null,null,""]
[0,0,1,null,null,null,20,null,null,null,null,null,"",null,null,null,null,null,null,null,null,null,null,null,null,null,null,null,45,null,null,null,null,null,null,""]
[0,0,1,null,null,null,21,null,null,null,null,null,"",null,null,null,null,null,null,null,null,null,null,null,null,null,null,null,46,null,null,null,null,null,null,""]
[0,0,1,null,null,null,22,null,null,null,null,null,"",null,null,null,null,null,null,null,null,null,null,null,null,null,null,null,47,null,null,null,null,null,null,""]
[0,0,1,null,null,null,23,null,null,null,null,null,"",null,null,null,null,null,null,null,null,null,null,null,null,null,null,null,48,null,null,null,null,null,null,""]
[0,0,1,null,null,null,24,null,null,null,null,null,"",null,null,null,null,null,null,null,null,null,null,null,null,null,null,null,49,null,null,null,null,null,null,""]
[0,0,1,null,null,null,25,null,null,null,null,null,{"$f":"IF(ISERROR(VLOOKUP(J154,carreras,2,FALSE)),\"\",VLOOKUP(J154,carreras,2,FALSE))","v":""},null,null,null,null,null,null,null,null,null,null,null,null,null,null,null,50,null,null,null,null,null,null,""]
[null,{"$f":"SUM(A130:B154)","v":0},{"$f":"SUM(C130:C154)","v":25}]
[]
[]
["TABLA 01 - Gestión"]
["01: Púb. Gestión Directa",null,null,null,null,null,null,null,null,null,null,null,null,null,null,null,null,null,null,null,null,null,null,null,null,null,null,null,null,null,null,null,null,null,null,{"$f":"IF(ISERROR(VLOOKUP(AG159,carreras,2,FALSE)),\"\",VLOOKUP(AG159,carreras,2,FALSE))","v":""}]
["02: Púb. Gestión Privada"]
["03: Privada"]
[]
[]
["TABLA 01 - Nivel"]
["A1: INICIAL - Cuna "]
["A2: INICIAL - Jardín"]
["A3: INICIAL - Cuna Jardín"]
["A5: INICIAL No Escolarizado"]
["B0: EBR-Primaria"]
["F0: EBR-Secundaria"]
["D1: EBA-Ini e Int"]
["D2: EBA-Avanzado"]
["E0: EBE-PRITE"]
["E1: EBE-Inicial"]
["E2: EBE-Primaria"]
["K0: IESP"]
["P0: EESP"]
["T0: IEST"]
["S0: EEST"]
["M0: ESFA"]
["L0: ETP-CETPRO"]
[]
[]
["TABLA (SI NO)"]
["SI"]
["NO"]
[]
[]
["Código de Nivel"]
["K0: IESP"]
["P0: EESP"]
["T0: IEST"]
["S0: EEST"]
["M0: ESFA"]
["L0: ETP"]
[]
[]
["TABLA 03 - Carateristica"]
["01: Unidocente"]
["02: Pol.Multigrado"]
["03: Pol.Completo"]
["04: No aplica"]
[]
[]
["Meses"]
["01: Enero"]
["02: Febrero"]
["03: Marzo"]
["04: Abril"]
["05: Mayo"]
["06: Junio"]
["07: Julio"]
["08: Agosto"]
["09: Setiembre"]
["10: Octubre"]
["11: Noviembre"]
["12: Diciembre"]
[]
[]
["Cedula_5A"]
["01","EDUCACIÓN INICIAL"]
["02","EDUCACIÓN PRIMARIA"]
["03","EDUCACIÓN INICIAL INTERCULTURAL BILINGÜE"]
["04","EDUCACIÓN PRIMARIA INTERCULTURAL BILINGÜE"]
["05","EDUCACIÓN BÁSICA ALTERNATIVA"]
["06","EDUCACIÓN ESPECIAL"]
["07","EDUCACIÓN FÍSICA"]
["08","EDUCACIÓN ARTÍSTICA"]
["09","E.S. LENGUA Y LITERATURA"]
["10","E.S. ESPECIALIDAD COMUNICACIÓN"]
["11","E.S. MATEMÁTICA Y FÍSICA"]
["12","E.S. ESPECIALIDAD MATEMÁTICA"]
["13","E.S. CCSS Y FILOSOFÍA"]
["14","E.S. ESPECIALIDAD CIUDADANÍA Y CIENCIAS SOCIALES"]
["15","E.S. CIENCIAS NATURALES"]
["16","E.S. ESPECIALIDAD CIENCIA Y TECNOLOGÍA"]
["17","E.S. ALIMENTACIÓN Y NUTRICIÓN"]
["18","E.S. BIOLOGÍA Y QUÍMICA"]
["19","E.S. HISTORIA Y GEOGRAFÍA"]
["20","E.S. CC.HH. SOCIALES"]
["21","IDIOMAS ESPECIALIDAD INGLÉS"]
["22","EDUCACIÓN RELIGIOSA"]
["23","E.S. EDUCACIÓN FAMILIAR"]
["24","E.T. ARTES INDUSTRIALES"]
["25","E.T. ARTESANÍA"]
["26","E.T. AGROPECUARIA"]
["27","E.T. CONSTRUCCIÓN EN MADERA"]
["28","COMPUTACIÓN E INFORMÁTICA"]
["29","E.T. CARPINTERÍA / EBANISTERÍA"]
["30","E.T. ELECTRICIDAD"]
["31","E.T. ELECTRÓNICA"]
["32","E.T. EBANISTERÍA"]
["33","E.T. INDUSTRIA DEL VESTIDO"]
["34","E.T. INDUSTRIA DEL VESTIDO ALIMENTACIÓN Y ALTA COSTURA"]
["35","E.T. EN INDUSTRIA DEL VESTIDO Y ALTA COSTURA"]
["36","E.S.TÉCNICA ESPECIALIDAD IND. DEL VESTIDO IND.ALIMENTARIA Y ARTESANÍA"]
["37","E.T. INDUSTRIA ALIMENTARIA"]
["38","E.T. MECÁNICA AUTOMOTRIZ"]
["39","E.T. MECÁNICA DE PRODUCCIÓN"]
["40","E.T. MECÁNICA DE PRODUCCIÓN Y SOLDADURA"]
["41","EDUCACIÓN PARA EL TRABAJO: TEXTIL Y CONFECCIÓN"]
["42","OTRO"]
["Cedula_7A",""]
["APF2156520","ARTE DRAMÁTICO","Profesional"]
["APF2136668","ARTES PLÁSTICAS Y VISUALES EN LA ESPECIALIDAD DE ESCULTURA","Profesional"]
["APF2136669","ARTES PLÁSTICAS Y VISUALES EN LA ESPECIALIDAD DE GRABADO Y CERÁMICA","Profesional"]
["APF2136670","ARTES PLÁSTICAS Y VISUALES EN LA ESPECIALIDAD DE PINTURA","Profesional"]
["APF2136671","ARTES VISUALES CON MENCIÓN EN ACUARELA","Profesional"]
["APF2136672","ARTES VISUALES CON MENCIÓN EN CERÁMICA","Profesional"]
["APF2136673","ARTES VISUALES CON MENCIÓN EN ESCULTURA","Profesional"]
["APF2136674","ARTES VISUALES CON MENCIÓN EN PINTURA","Profesional"]
["APF2156675","ARTISTA MÚSICO EN LA ESPECIALIDAD DE COMPOSICIÓN","Profesional"]
["APF2156676","ARTISTA MÚSICO EN LA ESPECIALIDAD DE EJECUCIÓN INSTRUMENTAL Y CANTO","Profesional"]
["APF2136677","ARTISTA PROFESIONAL ARTES PLÁSTICAS Y VISUALES","Profesional"]
["APF2242837","ARTISTA PROFESIONAL CON MENCIÓN EN DIRECCIÓN CORAL","Profesional"]
["APF2242938","ARTISTA PROFESIONAL CON MENCIÓN EN DIRECCIÓN INSTRUMENTAL","Profesional"]
["APF2243039","ARTISTA PROFESIONAL CON MENCIÓN EN EJECUCIÓN INSTRUMENTAL","Profesional"]
["APF2136490","ARTÍSTA PROFESIONAL EN ARTES PLÁSTICAS Y VISUALES","Profesional"]
["APF2156493","ARTISTA PROFESIONAL EN DANZA","Profesional"]
["APF2156649","ARTISTA PROFESIONAL EN FOLKLORE CON MENCIÓN EN DANZA","Profesional"]
["APF2156650","ARTISTA PROFESIONAL EN FOLKLORE CON MENCIÓN EN MÚSICA","Profesional"]
["APF2156522","ARTISTA PROFESIONAL EN FOLKLORE","Profesional"]
["APF2156651","ARTISTA PROFESIONAL EN LA ESPECIALIDAD ACTUACIÓN TEATRAL","Profesional"]
["APF2136685","ARTISTA PROFESIONAL EN LA ESPECIALIDAD ARTES PLÁSTICAS Y VISUALES CON MENCIÓN EN ESCULTURA","Profesional"]
["APF2136686","ARTISTA PROFESIONAL EN LA ESPECIALIDAD ARTES PLÁSTICAS Y VISUALES CON MENCIÓN EN GRABADO DISEÑO GRÁFICO","Profesional"]
["APF2136687","ARTISTA PROFESIONAL EN LA ESPECIALIDAD ARTES PLÁSTICAS Y VISUALES CON MENCIÓN EN PINTURA","Profesional"]
["APF2136645","ARTISTA PROFESIONAL EN LA ESPECIALIDAD DE ARTES PLÁSTICAS","Profesional"]
["APF2136678","ARTISTA PROFESIONAL EN LA ESPECIALIDAD DE ARTES PLÁSTICAS","Profesional"]
["APF2136689","ARTISTA PROFESIONAL EN LA ESPECIALIDAD DE ARTES PLÁSTICAS Y VISUALES","Profesional"]
["APF2156690","ARTISTA PROFESIONAL EN LA ESPECIALIDAD DE DANZA","Profesional"]
["APF2136681","ARTISTA PROFESIONAL EN LA ESPECIALIDAD DE ESCULTURA","Profesional"]
["APF2136682","ARTISTA PROFESIONAL EN LA ESPECIALIDAD DE GRABADO","Profesional"]
["APF2156691","ARTISTA PROFESIONAL EN LA ESPECIALIDAD DE MÚSICA","Profesional"]
["APF2136683","ARTISTA PROFESIONAL EN LA ESPECIALIDAD DE PINTURA","Profesional"]
["APF2136684","ARTISTA PROFESIONAL EN LA ESPECIALIDAD DE PRODUCCIÓN EN DISEÑO GRÁFICO Y ARTES PUBLICITARIAS","Profesional"]
["APF2156692","ARTISTA PROFESIONAL EN LA ESPECIALIDAD DE TEATRO","Profesional"]
["APF2136646","ARTISTA PROFESIONAL EN LA ESPECIALIDAD EN ARTES PLÁSTICAS CON MENCIÓN EN ESCULTURA","Profesional"]
["APF2136647","ARTISTA PROFESIONAL EN LA ESPECIALIDAD EN ARTES PLÁSTICAS CON MENCIÓN EN GRABADO","Profesional"]
["APF2136648","ARTISTA PROFESIONAL EN LA ESPECIALIDAD EN ARTES PLÁSTICAS CON MENCIÓN EN PINTURA","Profesional"]
["APF2156652","ARTISTA PROFESIONAL EN LA ESPECIALIDAD MÚSICA","Profesional"]
["APF2156693","ARTISTA PROFESIONAL EN LA INTERPRETACIÓN MUSICAL","Profesional"]
["APF2156491","ARTISTA PROFESIONAL EN MÚSICA","Profesional"]
["APF2136680","ARTISTA PROFESIONAL EN PINTURA Y ESCULTURA","Profesional"]
["APF2156492","ARTISTA PROFESIONAL EN TEATRO","Profesional"]
["APF2253140","ARTISTA PROFESIONAL ESPECIALIDAD ARTE DRAMÁTICO","Profesional"]
["APF2136694","CONSERVACIÓN Y RESTAURACIÓN","Profesional"]
["APF2156132","DANZA","Profesional"]
["APF2156664","DOCENTE EN DANZA CLÁSICA","Profesional"]
["APF1616526","DOCENTE EN EDUCACIÓN EN DANZA","Profesional"]
["APF1616525","DOCENTE EN EDUCACIÓN MUSICAL CON MENCIÓN EN UN INSTRUMENTO","Profesional"]
["APF1616524","DOCENTE EN EDUCACIÓN MUSICAL","Profesional"]
["APF1616695","EDUCACIÓN ARTÍSTICA ARTES PLÁSTICAS Y VISUALES","Profesional"]
["APF1616696","EDUCACIÓN ARTÍSTICA CON MENCIÓN EN ARTES PLÁSTICAS","Profesional"]
["APF1616697","EDUCACIÓN ARTÍSTICA CON MENCIÓN EN DANZA","Profesional"]
["APF1616698","EDUCACIÓN ARTÍSTICA CON MENCIÓN EN MÚSICA","Profesional"]
["APF1616699","EDUCACIÓN ARTÍSTICA CON MENCIÓN EN TEATRO","Profesional"]
["APF1616494","EDUCACIÓN ARTÍSTICA EN ARTES PLÁSTICAS Y VISUALES","Profesional"]
["APF1616497","EDUCACIÓN ARTÍSTICA EN DANZA","Profesional"]
["APF1616653","EDUCACIÓN ARTÍSTICA EN FOLKLORE CON MENCIÓN EN DANZA","Profesional"]
["APF1616654","EDUCACIÓN ARTÍSTICA EN FOLKLORE CON MENCIÓN EN MÚSICA","Profesional"]
["APF1616523","EDUCACIÓN ARTÍSTICA EN FOLKLORE","Profesional"]
["APF1616658","EDUCACIÓN ARTÍSTICA EN LA ESPECIALIDAD DANZAS FOLKLÓRICAS","Profesional"]
["APF1616659","EDUCACIÓN ARTÍSTICA EN LA ESPECIALIDAD DE ARTE DRAMÁTICO","Profesional"]
["APF1616708","EDUCACIÓN ARTÍSTICA EN LA ESPECIALIDAD DE ARTES PLÁSTICAS","Profesional"]
["APF1616655","EDUCACIÓN ARTÍSTICA EN LA ESPECIALIDAD DE ARTES PLÁSTICAS Y VISUALES","Profesional"]
["APF1616702","EDUCACIÓN ARTÍSTICA EN LA ESPECIALIDAD DE ARTES PLÁSTICAS Y VISUALES","Profesional"]
["APF1616703","EDUCACIÓN ARTÍSTICA EN LA ESPECIALIDAD DE ARTES VISUALES","Profesional"]
["APF1616656","EDUCACIÓN ARTÍSTICA EN LA ESPECIALIDAD DE DANZA","Profesional"]
["APF1616709","EDUCACIÓN ARTÍSTICA EN LA ESPECIALIDAD DE DANZA FOLKLÓRICA","Profesional"]
["APF1616657","EDUCACIÓN ARTÍSTICA EN LA ESPECIALIDAD DE EDUCACIÓN MUSICAL","Profesional"]
["APF1616700","EDUCACIÓN ARTÍSTICA EN LA ESPECIALIDAD DE MÚSICA","Profesional"]
["APF1616707","EDUCACIÓN ARTÍSTICA EN LA ESPECIALIDAD DE TEATRO","Profesional"]
["APF1616711","EDUCACIÓN ARTÍSTICA EN LA ESPECIALIDAD EN ARTES VISUALES","Profesional"]
["APF1616712","EDUCACIÓN ARTÍSTICA EN LA ESPECIALIDAD EN DANZA","Profesional"]
["APF1616713","EDUCACIÓN ARTÍSTICA EN LA ESPECIALIDAD EN MÚSICA","Profesional"]
["APF1616714","EDUCACIÓN ARTÍSTICA EN LA ESPECIALIDAD EN TEATRO","Profesional"]
["APF1616660","EDUCACIÓN ARTÍSTICA EN LA ESPECIALIDAD MÚSICA","Profesional"]
["APF1616661","EDUCACIÓN ARTÍSTICA EN LA ESPECIALIDAD TEATRO","Profesional"]
["APF1616495","EDUCACIÓN ARTÍSTICA EN MÚSICA","Profesional"]
["APF1616496","EDUCACIÓN ARTÍSTICA EN TEATRO","Profesional"]
["APF1616716","EDUCACIÓN MUSICAL","Profesional"]
["APF1616665","EDUCACIÓN MUSICAL Y ARTES","Profesional"]
["APF1616717","FORMACIÓN ARTÍSTICA CON LA ESPECIALIDADE DE ARTES PLÁSTICAS","Profesional"]
["APF1616718","FORMACIÓN ARTÍSTICA CON LA ESPECIALIDADE DE MÚSICA","Profesional"]
["APF1616719","FORMACIÓN ARTÍSTICA EN LA ESPECIALIDAD EN DANZA CON MENCIÓN EN DANZA CLÁSICA, MODERNA O TRADICIONAL","Profesional"]
["APF1616720","FORMACIÓN ARTÍSTICA EN LA ESPECIALIDAD EN DIRECCIÓN MUSICAL CON MENCIÓN EN DIRECCIÓN CORAL ORQUESTAL O BANDA","Profesional"]
["APF1616721","FORMACIÓN ARTÍSTICA EN LA ESPECIALIDAD EN INTERPRETACIÓN INSTRUMENTAL CON MENCIÓN EN UN INSTRUMENTO","Profesional"]
["APF1616722","FORMACIÓN ARTÍSTICA EN LA ESPECIALIDAD EN MÚSICA CON MENCIÓN EN CANTO","Profesional"]
["APF1616723","FORMACIÓN ARTÍSTICA EN LA ESPECIALIDAD EN MÚSICA CON MENCIÓN EN COMPOSICIÓN MUSICAL","Profesional"]
["APF1616724","FORMACIÓN ARTÍSTICA EN LA ESPECIALIDAD EN MÚSICA CON MENCIÓN EN MUSICOLOGÍA","Profesional"]
["APF1616662","FORMACIÓN ARTÍSTICA EN LA ESPECIALIDAD TEATRO CON MENCIÓN EN ACTUACIÓN","Profesional"]
["APF1616663","FORMACIÓN ARTÍSTICA EN LA ESPECIALIDAD TEATRO CON MENCIÓN EN DISEÑO ESCENOGRÁFICO","Profesional"]
["APF1616725","FORMACIÓN DOCENTE EN LA ESPECIALIDAD EDUCACIÓN DANZA CON MENCIÓN EN DANZA CLÁSICA MODERNA O TRADICIONAL","Profesional"]
["APF1616727","FORMACIÓN DOCENTE EN LA ESPECIALIDAD EDUCACIÓN MUSICAL CON MENCIÓN EN UN INSTRUMENTO","Profesional"]
["APF1616726","FORMACIÓN DOCENTE EN LA ESPECIALIDAD EDUCACIÓN MUSICAL","Profesional"]
["APF2156527","INTERPRETACIÓN INSTRUMENTAL","Profesional"]
["APF2156528","INTERPRETACIÓN MUSICAL CANTO","Profesional"]
["APF2156728","INTERPRETACIÓN MUSICAL CON MENCIÓN EN ACORDEÓN","Profesional"]
["APF2156729","INTERPRETACIÓN MUSICAL CON MENCIÓN EN CANTO","Profesional"]
["APF2156730","INTERPRETACIÓN MUSICAL CON MENCIÓN EN CIOLÍN","Profesional"]
["APF2156731","INTERPRETACIÓN MUSICAL CON MENCIÓN EN CLARINETE","Profesional"]
["APF2156732","INTERPRETACIÓN MUSICAL CON MENCIÓN EN CONTRABAJO","Profesional"]
["APF2156733","INTERPRETACIÓN MUSICAL CON MENCIÓN EN CORNO","Profesional"]
["APF2156734","INTERPRETACIÓN MUSICAL CON MENCIÓN EN FAGOT","Profesional"]
["APF2156735","INTERPRETACIÓN MUSICAL CON MENCIÓN EN FLAUTA TRAVERSA","Profesional"]
["APF2156736","INTERPRETACIÓN MUSICAL CON MENCIÓN EN GUITARRA","Profesional"]
["APF2156737","INTERPRETACIÓN MUSICAL CON MENCIÓN EN INSTRUMENTOS NATIVOS","Profesional"]
["APF2156738","INTERPRETACIÓN MUSICAL CON MENCIÓN EN OBOE","Profesional"]
["APF2156739","INTERPRETACIÓN MUSICAL CON MENCIÓN EN PERCUSIÓN","Profesional"]
["APF2156740","INTERPRETACIÓN MUSICAL CON MENCIÓN EN PIANO","Profesional"]
["APF2156741","INTERPRETACIÓN MUSICAL CON MENCIÓN EN SAXOFÓN","Profesional"]
["APF2156742","INTERPRETACIÓN MUSICAL CON MENCIÓN EN TROMBÓN","Profesional"]
["APF2156743","INTERPRETACIÓN MUSICAL CON MENCIÓN EN TROMPETA","Profesional"]
["APF2156744","INTERPRETACIÓN MUSICAL CON MENCIÓN EN TUBA","Profesional"]
["APF2156745","INTERPRETACIÓN MUSICAL CON MENCIÓN EN VIOLA","Profesional"]
["APF2156746","INTERPRETACIÓN MUSICAL CON MENCIÓN EN VIOLONCHELLO","Profesional"]
["APF2156666","INTERPRETACIÓN MUSICAL","Profesional"]
["APF2156667","INTÉRPRETE EN DANZA CLÁSICA","Profesional"]
["APF2136747","MEDIOS AUDIOVISUALES","Profesional"]
["APF2156748","MÚSICA","Profesional"]
["APF2156751","MÚSICA EN LA ESPECIALIDAD DE EJECUCIÓN INSTRUMENTAL CON MENCIÓN EN CANTO","Profesional"]
["APF2156752","MÚSICA EN LA ESPECIALIDAD DE EJECUCIÓN INSTRUMENTAL CON MENCIÓN EN COMPOSICIÓN","Profesional"]
["APF2156753","MÚSICA EN LA ESPECIALIDAD DE EJECUCIÓN INSTRUMENTAL CON MENCIÓN EN DIRECCIÓN CORAL","Profesional"]
["APF2156754","MÚSICA EN LA ESPECIALIDAD DE EJECUCIÓN INSTRUMENTAL CON MENCIÓN EN DIRECCIÓN DE BANDA","Profesional"]
["APF2156131","MÚSICA","Profesional"]
["APF2156749","MÚSICA Y ARTES VISUALES DEL ÁREA DE DOCENCIA","Profesional"]
["APF2156750","MÚSICA Y TÉCNOLOGÍAS DE SONIDO, ESPECIALIDAD EN PRODUCCIÓN MUSICAL","Profesional"]
["APF2156755","MÚSICO PROFESIONAL EN LA ESPECIALIDAD DE INTERPRETACIÓN MUSICAL CANTO","Profesional"]
["APF2156756","MÚSICO PROFESIONAL EN LA ESPECIALIDAD DE INTERPRETACIÓN MUSICAL CON MENCIÓN EN ARPA","Profesional"]
["APF2156757","MÚSICO PROFESIONAL EN LA ESPECIALIDAD DE INTERPRETACIÓN MUSICAL CON MENCIÓN EN CHARANGO","Profesional"]
["APF2156758","MÚSICO PROFESIONAL EN LA ESPECIALIDAD DE INTERPRETACIÓN MUSICAL CON MENCIÓN EN CLARINETE","Profesional"]
["APF2156759","MÚSICO PROFESIONAL EN LA ESPECIALIDAD DE INTERPRETACIÓN MUSICAL CON MENCIÓN EN CONTRABAJO","Profesional"]
["APF2156760","MÚSICO PROFESIONAL EN LA ESPECIALIDAD DE INTERPRETACIÓN MUSICAL CON MENCIÓN EN CORNO","Profesional"]
["APF2156761","MÚSICO PROFESIONAL EN LA ESPECIALIDAD DE INTERPRETACIÓN MUSICAL CON MENCIÓN EN EUFONIO","Profesional"]
["APF2156762","MÚSICO PROFESIONAL EN LA ESPECIALIDAD DE INTERPRETACIÓN MUSICAL CON MENCIÓN EN FAGOT","Profesional"]
["APF2156763","MÚSICO PROFESIONAL EN LA ESPECIALIDAD DE INTERPRETACIÓN MUSICAL CON MENCIÓN EN FLAUTA DULCE","Profesional"]
["APF2156764","MÚSICO PROFESIONAL EN LA ESPECIALIDAD DE INTERPRETACIÓN MUSICAL CON MENCIÓN EN FLAUTA TRAVERSA","Profesional"]
["APF2156765","MÚSICO PROFESIONAL EN LA ESPECIALIDAD DE INTERPRETACIÓN MUSICAL CON MENCIÓN EN GUITARRA","Profesional"]
["APF2156766","MÚSICO PROFESIONAL EN LA ESPECIALIDAD DE INTERPRETACIÓN MUSICAL CON MENCIÓN EN OBOE","Profesional"]
["APF2156767","MÚSICO PROFESIONAL EN LA ESPECIALIDAD DE INTERPRETACIÓN MUSICAL CON MENCIÓN EN ORGANO","Profesional"]
["APF2156768","MÚSICO PROFESIONAL EN LA ESPECIALIDAD DE INTERPRETACIÓN MUSICAL CON MENCIÓN EN PERCUSIÓN","Profesional"]
["APF2156769","MÚSICO PROFESIONAL EN LA ESPECIALIDAD DE INTERPRETACIÓN MUSICAL CON MENCIÓN EN PIANO","Profesional"]
["APF2156770","MÚSICO PROFESIONAL EN LA ESPECIALIDAD DE INTERPRETACIÓN MUSICAL CON MENCIÓN EN QUENA","Profesional"]
["APF2156771","MÚSICO PROFESIONAL EN LA ESPECIALIDAD DE INTERPRETACIÓN MUSICAL CON MENCIÓN EN SAXOFÓN","Profesional"]
["APF2156772","MÚSICO PROFESIONAL EN LA ESPECIALIDAD DE INTERPRETACIÓN MUSICAL CON MENCIÓN EN TROMBÓN","Profesional"]
["APF2156773","MÚSICO PROFESIONAL EN LA ESPECIALIDAD DE INTERPRETACIÓN MUSICAL CON MENCIÓN EN TROMPETA","Profesional"]
["APF2156774","MÚSICO PROFESIONAL EN LA ESPECIALIDAD DE INTERPRETACIÓN MUSICAL CON MENCIÓN EN TUBA","Profesional"]
["APF2156775","MÚSICO PROFESIONAL EN LA ESPECIALIDAD DE INTERPRETACIÓN MUSICAL CON MENCIÓN EN VIOLA","Profesional"]
["APF2156776","MÚSICO PROFESIONAL EN LA ESPECIALIDAD DE INTERPRETACIÓN MUSICAL CON MENCIÓN EN VIOLÍN","Profesional"]
["APF2156777","MÚSICO PROFESIONAL EN LA ESPECIALIDAD DE INTERPRETACIÓN MUSICAL CON MENCIÓN EN VIOLONCHELLO","Profesional"]
["APF2156778","MÚSICO PROFESIONAL EN LA ESPECIALIDAD DE INTERPRETACIÓN MUSICAL DIRECCIÓN MUSICAL","Profesional"]
["APF1616779","PROFESOR DE EDUCACIÓN ARTÍSTICA EN LA ESPECIALIDAD ARTES VISUALES","Profesional"]
["APF1616780","PROFESOR DE EDUCACIÓN ARTÍSTICA EN LA ESPECIALIDAD DANZA","Profesional"]
["APF1616781","PROFESOR DE EDUCACIÓN ARTÍSTICA EN LA ESPECIALIDAD MÚSICA","Profesional"]
["APF1616782","PROFESOR DE EDUCACIÓN ARTÍSTICA EN LA ESPECIALIDAD TEATRO","Profesional"]
["APF2136783","PROGRAMA ACADÉMICO DE ARTES PLÁSTICAS Y VISUALES EN LA ESPECIALIDAD DE ESCULTURA","Profesional"]
["APF2136784","PROGRAMA ACADÉMICO DE ARTES PLÁSTICAS Y VISUALES EN LA ESPECIALIDAD DE GRABADO","Profesional"]
["APF2136785","PROGRAMA ACADÉMICO DE ARTES PLÁSTICAS Y VISUALES EN LA ESPECIALIDAD DE PINTURA","Profesional"]
["APF2136786","PROGRAMA ACADÉMICO DE ARTES PLÁSTICAS Y VISUALES EN LA ESPECIALIDAD DE RESTAURACIÓN Y CONSERVACIÓN","Profesional"]
["APF2156129","TEATRO","Profesional"]
["APFAG99999","OTROS","Profesional"]
["Cedula_6A",""]
["SPF24X0417","ADMINISTRACIÓN DE CIBERSEGURIDAD","PROFESIONAL"]
["SPF24X0418","ADMINISTRACIÓN DE COMPUTACIÓN EN LA NUBE","PROFESIONAL"]
["SPF4130008","ADMINISTRACIÓN DE EMPRESAS","PROFESIONAL"]
["SPF0140011","ADMINISTRACIÓN DE EMPRESAS TURÍSTICAS Y HOTELERAS","PROFESIONAL"]
["SPF4130009","ADMINISTRACIÓN DE EMPRESAS Y CONTABILIDAD","PROFESIONAL"]
["SPF0120012","ADMINISTRACIÓN DE HOTELES, RESTAURANTES Y AFINES","PROFESIONAL"]
["SPF0140211","ADMINISTRACIÓN DE INDUSTRIAS TURÍSTICAS Y HOTELERAS","PROFESIONAL"]
["SPF24X0419","ADMINISTRACIÓN DE NEGOCIOS INTERNACIONALES Y GESTIÓN ADUANERA","PROFESIONAL"]
["SPF24X0420","ADMINISTRACIÓN DE NEGOCIOS INTERNACIONALES Y LOGÍSTICA INTEGRAL","PROFESIONAL"]
["SPF4130010","ADMINISTRACIÓN DE NEGOCIOS","PROFESIONAL"]
["SPF24X0448","ADMINISTRACIÓN ESTRATÉGICA Y DIRECCIÓN EMPRESARIAL","PROFESIONAL"]
["SPF4136141","ADMINISTRACIÓN Y DIRECCIÓN DE NEGOCIOS","PROFESIONAL"]
["SPF24X0412","ADMINISTRACIÓN Y NEGOCIOS DIGITALES","PROFESIONAL"]
["SPF2116628","ANIMACIÓN DIGITAL","PROFESIONAL"]
["SPF7310023","ARQUITECTURA DE INTERIORES","PROFESIONAL"]
["SPF24X0414","ARQUITECTURA DE SISTEMAS DE INFORMACIÓN","PROFESIONAL"]
["SPF2136130","ARTES PLÁSTICAS Y VISUALES","PROFESIONAL"]
["SPF24X0431","ARTES VISUALES","PROFESIONAL"]
["SPF3220007","COMUNICACIÓN AUDIOVISUAL MULTIMEDIA","PROFESIONAL"]
["SPF3226143","COMUNICACIÓN ESTRATÉGICA","PROFESIONAL"]
["SPF24X0447","CONSERVACIÓN Y RESTAURACIÓN DE BIENES CULTURALES MATERIALES","PROFESIONAL"]
["SPF24X0421","CONTABILIDAD FINANCIERA Y TRIBUTARIA","PROFESIONAL"]
["SPF4116162","CONTABILIDAD Y FINANZAS","PROFESIONAL"]
["SPF24X0444","CREACIÓN MUSICAL","PROFESIONAL"]
["SPF24X0440","CREACIÓN Y DIRECCIÓN AUDIOVISUAL","PROFESIONAL"]
["SPF24X0422","DESARROLLO DE APLICATIVOS MOVILES","PROFESIONAL"]
["SPF24X0423","DESARROLLO DE SISTEMAS FRONT-END Y BACK-END","PROFESIONAL"]
["SPF2110003","DIRECCIÓN DE ARTES GRÁFICAS Y PUBLICITARIAS","PROFESIONAL"]
["SPF24X0415","DIRECCIÓN DE EMPRESAS","PROFESIONAL"]
["SPF24X0401","DIRECCIÓN DE INNOVACIÓN Y TRANSFORMACIÓN EMPRESARIAL","PROFESIONAL"]
["SPF24X0416","DIRECCIÓN DE MARKETING Y GESTIÓN COMERCIAL","PROFESIONAL"]
["SPF24X0402","DIRECCIÓN DE NEGOCIOS DIGITALES E INNOVACIÓN","PROFESIONAL"]
["SPF24X0407","DIRECCIÓN DE NEGOCIOS GLOBALES","PROFESIONAL"]
["SPF2116138","DIRECCIÓN DE PROYECTOS VISUALES Y FOTOGRAFÍA","PROFESIONAL"]
["SPF24X0408","DIRECCIÓN DE TECNOLOGÍAS DE LA INFORMACIÓN","PROFESIONAL"]
["SPF24X0409","DIRECCIÓN HOTELERA","PROFESIONAL"]
["SPF24X0410","DIRECCIÓN PUBLICITARIA","PROFESIONAL"]
["SPF24X0403","DIRECCIÓN Y DISEÑO GRAFICO","PROFESIONAL"]
["SPF2110004","DIRECCIÓN Y DISEÑO GRÁFICO","PROFESIONAL"]
["SPF2110005","DIRECCIÓN Y DISEÑO PUBLICITARIO","PROFESIONAL"]
["SPF2120110","DIRECCIÓN Y GESTIÓN DE LA MODA","PROFESIONAL"]
["SPF24X0404","DIRECCIÓN Y GESTIÓN DE PROYECTOS ANIMADOS","PROFESIONAL"]
["SPF24X0405","DIRECCIÓN Y GESTIÓN DE PROYECTOS DE VIDEOJUEGOS","PROFESIONAL"]
["SPF24X0424","DISEÑO DE INTERIORES E INNOVACIÓN DE ESPACIOS","PROFESIONAL"]
["SPF24X0432","DISEÑO DE INTERIORES Y GESTIÓN DE PROYECTOS","PROFESIONAL"]
["SPF2136117","DISEÑO DE PRODUCTO E INNOVACIÓN TECNOLÓGICA","PROFESIONAL"]
["SPF2116629","DISEÑO DE VIDEOJUEGOS Y ENTRETENIMIENTO DIGITAL","PROFESIONAL"]
["SPF24X0411","DISEÑO ESTRATÉGICO E INNOVACIÓN","PROFESIONAL"]
["SPF2116076","DISEÑO GRÁFICO","PROFESIONAL"]
["SPF24X0425","DISEÑO GRÁFICO PUBLICITARIO","PROFESIONAL"]
["SPF24X0426","DISEÑO GRÁFICO Y ANIMACIÓN","PROFESIONAL"]
["SPF24X0427","DISEÑO GRÁFICO Y EXPERIENCIA DE USUARIO","PROFESIONAL"]
["SPF24X0433","DISEÑO GRÁFICO Y GESTIÓN DE PROYECTOS","PROFESIONAL"]
["SPF2116630","DISEÑO Y COMUNICACIÓN VISUAL","PROFESIONAL"]
["SPF2120072","DISEÑO Y GESTIÓN DE LA MODA","PROFESIONAL"]
["SPF2136631","DISEÑO Y GESTIÓN DE MARCAS","PROFESIONAL"]
["SPF2110211","FOTOGRAFÍA","PROFESIONAL"]
["SPF2116573","FOTOGRAFÍA E IMAGEN DIGITAL","PROFESIONAL"]
["SPF24X0406","FOTOGRAFÍA Y DIRECCIÓN DE LA IMAGEN","PROFESIONAL"]
["SPF4126632","GESTIÓN BANCARIA Y FINANCIERA","PROFESIONAL"]
["SPF24X0428","GESTIÓN COMERCIAL DE BANCA","PROFESIONAL"]
["SPF24X0442","GESTIÓN COMERCIAL DE PRODUCTOS Y SERVICIOS BANCARIOS Y FINANCIEROS","PROFESIONAL"]
["SPF4116633","GESTIÓN CONTABLE, FINANCIERA Y TRIBUTARIA","PROFESIONAL"]
["SPF24X0437","GESTIÓN DE CONSERVACIÓN Y RECUPERACIÓN DE ECOSISTEMAS ACUÁTICOS","PROFESIONAL"]
["SPF4136634","GESTIÓN DE LA CADENA DE SUMINISTROS","PROFESIONAL"]
["SPF24X0445","GESTIÓN DE LA INDUSTRIA MUSICAL","PROFESIONAL"]
["SPF24X0441","GESTIÓN DE LA PRODUCCIÓN AUDIOVISUAL","PROFESIONAL"]
["SPF24X0443","GESTIÓN DE PROYECTOS CULTURALES Y ATÍSTICOS","PROFESIONAL"]
["SPF6126635","GESTIÓN DE SISTEMAS DE INFORMACIÓN","PROFESIONAL"]
["SPF4146636","GESTIÓN ESTRATÉGICA DE MARKETING","PROFESIONAL"]
["SPF4166637","GESTIÓN ESTRATÉGICA DE NEGOCIOS INTERNACIONALES","PROFESIONAL"]
["SPF24X0429","GESTIÓN ESTRATÉGICA DEL FACTOR HUMANO","PROFESIONAL"]
["SPF24X0438","GESTIÓN Y FORMULACIÓN DE ALIMENTOS Y BEBIDAS","PROFESIONAL"]
["SPF6116163","INGENIERÍA DE SISTEMAS DE INFORMACIÓN","PROFESIONAL"]
["SPF6130015","INGENIERÍA DE TELECOMUNICACIONES","PROFESIONAL"]
["SPF6130016","INGENIERÍA DE TELEMÁTICA","PROFESIONAL"]
["SPF24X0439","INSPECCIÓN Y MANTENIMIENTO AERONÁUTICO","PROFESIONAL"]
["SPF24X0446","INTERPRETACIÓN MUSICAL","PROFESIONAL"]
["SPF2210001","LITERATURA BÍBLICA","PROFESIONAL"]
["SPF4146142","MARKETING E INNOVACIÓN","PROFESIONAL"]
["SPF4146118","MARKETING ESTRATÉGICO E INNOVACIÓN","PROFESIONAL"]
["SPF24X0430","MARKETING ESTRATÉGICO Y GESTIÓN COMERCIAL","PROFESIONAL"]
["SPF4140013","MARKETING INTEGRAL","PROFESIONAL"]
["SPF24X0434","MARKETING Y PUBLICIDAD","PROFESIONAL"]
["SPF4136638","PLANIFICACIÓN DE PROCESOS ESTRATÉGICOS DE RECURSOS HUMANOS","PROFESIONAL"]
["SPF2116639","PUBLICIDAD Y COMUNICACIÓN COMERCIAL","PROFESIONAL"]
["SPF4140196","PUBLICIDAD Y MARKETING DIGITAL","PROFESIONAL"]
["SPF6120014","SISTEMAS INFORMÁTICOS PARA LA PRODUCTIVIDAD","PROFESIONAL"]
["SPF6130079","TÉCNICAS DE INGENIERÍA DE TELECOMUNICACIONES","PROFESIONAL"]
["SPF6130080","TÉCNICAS DE INGENIERÍA DE TELEMÁTICA","PROFESIONAL"]
["SPF7110018","TÉCNICAS DE INGENIERÍA ELÉCTRICA","PROFESIONAL"]
["SPF7120019","TÉCNICAS DE INGENIERÍA ELECTRÓNICA","PROFESIONAL"]
["SPF7130020","TÉCNICAS DE INGENIERÍA MECÁNICA DE MANTENIMIENTO","PROFESIONAL"]
["SPF7130021","TÉCNICAS DE INGENIERÍA MECÁNICA DE PRODUCCIÓN","PROFESIONAL"]
["SPF7116122","TÉCNICO EN INGENIERÍA ELÉCTRICA","PROFESIONAL"]
["SPF7126121","TÉCNICO EN INGENIERÍA ELECTRÓNICA","PROFESIONAL"]
["SPF7136072","TÉCNICO EN INGENIERÍA MECÁNICA","PROFESIONAL"]
["SPF8110024","TECNOLOGÍA AGRÍCOLA","PROFESIONAL"]
["SPF7130017","TECNOLOGÍA DE LA PRODUCCIÓN","PROFESIONAL"]
["SPF7130022","TECNOLOGÍA MECÁNICA ELÉCTRICA","PROFESIONAL"]
["SPF24X0413","TECNOLOGÍAS DE LA INFORMACIÓN","PROFESIONAL"]
["SPF2210002","TEOLOGÍA - EVANGÉLICA","PROFESIONAL"]
["SPF24X0435","TEOLOGÍA EVANGÉLICA","PROFESIONAL"]
["SPF2210175","TEOLOGÍA","PROFESIONAL"]
["SPF3130006","TERAPIA PSICOANALÍTICA","PROFESIONAL"]
["SPF24X0436","TRADUCCIÓN DE IDIOMAS","PROFESIONAL"]
["SPFAG99999","OTROS PROFESIONAL","PROFESIONAL"]
["SPT4181094","ABASTECIMIENTO","PROFESIONAL TÉCNICO"]
["SPT2151064","ACTUACIÓN","PROFESIONAL TÉCNICO"]
["SPT8311319","ACUICULTURA","PROFESIONAL TÉCNICO"]
["SPT24X0445","ACUICULTURA Y PROCESAMIENTO PESQUERO","PROFESIONAL TÉCNICO"]
["SPT4121097","ADMINISTRACIÓN BANCARIA POR COMPETENCIAS","PROFESIONAL TÉCNICO"]
["SPT4121096","ADMINISTRACIÓN BANCARIA","PROFESIONAL TÉCNICO"]
["SPT4121098","ADMINISTRACIÓN BANCARIA Y FINANCIERA","PROFESIONAL TÉCNICO"]
["SPT6120312","ADMINISTRACIÓN CON TECNOLOGÍAS DE LA INFORMACIÓN","PROFESIONAL TÉCNICO"]
["SPT4131099","ADMINISTRACIÓN DE AEROPUERTOS","PROFESIONAL TÉCNICO"]
["SPT4131100","ADMINISTRACIÓN DE AGENCIA DE VIAJES","PROFESIONAL TÉCNICO"]
["SPT4121101","ADMINISTRACIÓN DE BANCA Y FINANZAS","PROFESIONAL TÉCNICO"]
["SPT0120015","ADMINISTRACIÓN DE BAR","PROFESIONAL TÉCNICO"]
["SPT6121185","ADMINISTRACIÓN DE CENTRO DE CÓMPUTO","PROFESIONAL TÉCNICO"]
["SPT6116178","ADMINISTRACIÓN DE CENTROS DE CÓMPUTO CON MENCIÓN EN\nIMPLEMENTACIÓN, CONFIGURACIÓN Y REPARACIÓN DE COMPUTADORAS","PROFESIONAL TÉCNICO"]
["SPT24X0407","ADMINISTRACIÓN DE CENTROS DE COMPUTO","PROFESIONAL TÉCNICO"]
["SPT6126106","ADMINISTRACIÓN DE CENTROS DE CÓMPUTO","PROFESIONAL TÉCNICO"]
["SPT9999002","ADMINISTRACION DE EMPRESAS","PROFESIONAL TÉCNICO"]
["SPT4136597","ADMINISTRACIÓN DE EMPRESAS CON MENCIÓN EN AGRONEGOCIOS","PROFESIONAL TÉCNICO"]
["SPT4136137","ADMINISTRACIÓN DE EMPRESAS CON MENCIÓN EN EMPRESAS INDUSTRIALES","PROFESIONAL TÉCNICO"]
["SPT4136145","ADMINISTRACIÓN DE EMPRESAS CON MENCIÓN EN FINANZAS","PROFESIONAL TÉCNICO"]
["SPT4136136","ADMINISTRACIÓN DE EMPRESAS CON MENCIÓN EN GESTIÓN EMPRESARIAL","PROFESIONAL TÉCNICO"]
["SPT4131103","ADMINISTRACIÓN DE EMPRESAS DE TRANSPORTES","PROFESIONAL TÉCNICO"]
["SPT0120206","ADMINISTRACIÓN DE EMPRESAS HOTELERAS","PROFESIONAL TÉCNICO"]
["SPT4131102","ADMINISTRACIÓN DE EMPRESAS","PROFESIONAL TÉCNICO"]
["SPT0141121","ADMINISTRACIÓN DE EMPRESAS TURÍSTICAS","PROFESIONAL TÉCNICO"]
["SPT0141122","ADMINISTRACIÓN DE EMPRESAS TURÍSTICAS Y HOTELERAS","PROFESIONAL TÉCNICO"]
["SPT4130105","ADMINISTRACIÓN DE EMPRESAS Y CONTABILIDAD","PROFESIONAL TÉCNICO"]
["SPT24X0439","ADMINISTRACIÓN DE EMPRESAS Y FINANZAS","PROFESIONAL TÉCNICO"]
["SPT4136542","ADMINISTRACIÓN DE EMPRESAS Y GESTIÓN DE EQUIPOS","PROFESIONAL TÉCNICO"]
["SPT4136543","ADMINISTRACIÓN DE EMPRESAS Y GESTIÓN DE MARKETING","PROFESIONAL TÉCNICO"]
["SPT4136544","ADMINISTRACIÓN DE EMPRESAS Y GESTIÓN DE RECURSOS HUMANOS","PROFESIONAL TÉCNICO"]
["SPT4136545","ADMINISTRACIÓN DE EMPRESAS Y GESTIÓN FINANCIERA","PROFESIONAL TÉCNICO"]
["SPT24X0417","ADMINISTRACIÓN DE EMPRESAS Y TRANSFORMACIÓN DIGITAL","PROFESIONAL TÉCNICO"]
["SPT0121123","ADMINISTRACIÓN DE HOSTELERÍA","PROFESIONAL TÉCNICO"]
["SPT0121124","ADMINISTRACIÓN DE HOTELES Y RESTAURANTES","PROFESIONAL TÉCNICO"]
["SPT0121125","ADMINISTRACIÓN DE HOTELES, RESTAURANTES Y AFINES","PROFESIONAL TÉCNICO"]
["SPT0140035","ADMINISTRACIÓN DE INDUSTRIAS TURÍSTICAS Y HOTELERAS","PROFESIONAL TÉCNICO"]
["SPT9999001","ADMINISTRACIÓN DE NEGOCIOS AGROPECUARIOS","PROFESIONAL TÉCNICO"]
["SPT4131301","ADMINISTRACIÓN DE NEGOCIOS AGROPECUARIOS","PROFESIONAL TÉCNICO"]
["SPT4120222","ADMINISTRACIÓN DE NEGOCIOS BANCARIOS Y FINANCIEROS","PROFESIONAL TÉCNICO"]
["SPT4126546","ADMINISTRACIÓN DE NEGOCIOS BANCARIOS Y MICROFINANZAS","PROFESIONAL TÉCNICO"]
["SPT4126547","ADMINISTRACIÓN DE NEGOCIOS BANCARIOS, FINANCIEROS Y BANCA DIGITAL","PROFESIONAL TÉCNICO"]
["SPT4126548","ADMINISTRACIÓN DE NEGOCIOS BANCARIOS, FINANCIEROS Y GESTIÓN DE EQUIPOS","PROFESIONAL TÉCNICO"]
["SPT4130413","ADMINISTRACIÓN DE NEGOCIOS CON MENCIÓN EN COMERCIALIZACIÓN","PROFESIONAL TÉCNICO"]
["SPT24X0405","ADMINISTRACIÓN DE NEGOCIOS DIGITALES","PROFESIONAL TÉCNICO"]
["SPT0141127","ADMINISTRACIÓN DE NEGOCIOS INTERNACIONALES DE TURISMO","PROFESIONAL TÉCNICO"]
["SPT4161146","ADMINISTRACIÓN DE NEGOCIOS INTERNACIONALES","PROFESIONAL TÉCNICO"]
["SPT4166549","ADMINISTRACIÓN DE NEGOCIOS INTERNACIONALES Y GESTIÓN DE FINANZAS INTERNACIONALES","PROFESIONAL TÉCNICO"]
["SPT4160514","ADMINISTRACIÓN DE NEGOCIOS INTERNACIONALES Y MARKETING INTERNACIONAL","PROFESIONAL TÉCNICO"]
["SPT4131104","ADMINISTRACIÓN DE NEGOCIOS","PROFESIONAL TÉCNICO"]
["SPT0140166","ADMINISTRACIÓN DE NEGOCIOS TURÍSTICOS","PROFESIONAL TÉCNICO"]
["SPT4130115","ADMINISTRACIÓN DE NEGOCIOS Y DIRECCIÓN DE VENTAS","PROFESIONAL TÉCNICO"]
["SPT4130083","ADMINISTRACIÓN DE NEGOCIOS Y GESTIÓN DEL EMPRENDIMIENTO","PROFESIONAL TÉCNICO"]
["SPT4131105","ADMINISTRACIÓN DE NEGOCIOS Y VENTAS","PROFESIONAL TÉCNICO"]
["SPT4126146","ADMINISTRACIÓN DE OPERACIONES BANCARIAS Y FINANCIERAS","PROFESIONAL TÉCNICO"]
["SPT0146084","ADMINISTRACIÓN DE OPERACIONES TURÍSTICAS","PROFESIONAL TÉCNICO"]
["SPT7240130","ADMINISTRACIÓN DE OPERACIONES Y MINERÍA","PROFESIONAL TÉCNICO"]
["SPT6116180","ADMINISTRACION DE PLATAFORMAS","PROFESIONAL TÉCNICO"]
["SPT6116105","ADMINISTRACIÓN DE PLATAFORMAS Y SERVICIOS WEB","PROFESIONAL TÉCNICO"]
["SPT8210162","ADMINISTRACIÓN DE RECURSOS AGROPECUARIOS Y FORESTALES","PROFESIONAL TÉCNICO"]
["SPT8211316","ADMINISTRACIÓN DE RECURSOS FORESTALES","PROFESIONAL TÉCNICO"]
["SPT4181158","ADMINISTRACIÓN DE RECURSOS HUMANOS","PROFESIONAL TÉCNICO"]
["SPT6116165","ADMINISTRACIÓN DE REDES Y COMUNICACIÓN","PROFESIONAL TÉCNICO"]
["SPT6126591","ADMINISTRACIÓN DE REDES Y COMUNICACIONES CON MENCIÓN EN VIRTUALIZACIÓN Y SEGURIDAD INFORMÁTICA","PROFESIONAL TÉCNICO"]
["SPT6120215","ADMINISTRACIÓN DE REDES Y COMUNICACIONES","PROFESIONAL TÉCNICO"]
["SPT4121106","ADMINISTRACIÓN DE SEGUROS","PROFESIONAL TÉCNICO"]
["SPT0121126","ADMINISTRACIÓN DE SERVICIOS DE HOSTELERÍA","PROFESIONAL TÉCNICO"]
["SPT0126601","ADMINISTRACIÓN DE SERVICIOS DE HOSTELERÍA Y RESTAURANTES CON\nMENCIÓN EN GERENCIA DE LA HOSPITALIDAD INTERNACIONAL","PROFESIONAL TÉCNICO"]
["SPT0120615","ADMINISTRACIÓN DE SERVICIOS DE HOSTELERÍA Y RESTAURANTES CON MENCIÓN EN SERVICIOS","PROFESIONAL TÉCNICO"]
["SPT0126102","ADMINISTRACIÓN DE SERVICIOS DE HOSTELERÍA Y RESTAURANTES","PROFESIONAL TÉCNICO"]
["SPT4131159","ADMINISTRACIÓN DE SERVICIOS DE POSTALES","PROFESIONAL TÉCNICO"]
["SPT0126071","ADMINISTRACIÓN DE SERVICIOS EN HOSTELERÍA","PROFESIONAL TÉCNICO"]
["SPT0120122","ADMINISTRACIÓN DE SERVICIOS TURÍSTICOS","PROFESIONAL TÉCNICO"]
["SPT0140177","ADMINISTRACIÓN DE SERVICIOS TURÍSTICOS Y HOTELES","PROFESIONAL TÉCNICO"]
["SPT6126551","ADMINISTRACIÓN DE SISTEMAS PARA LA TRANSFORMACIÓN DIGITAL","PROFESIONAL TÉCNICO"]
["SPT6126552","ADMINISTRACIÓN DE SISTEMAS Y PRUEBAS DE SOLUCIONES\nMULTIPLATAFORMA PARA LA TRANSFORMACIÓN DIGITAL","PROFESIONAL TÉCNICO"]
["SPT6126553","ADMINISTRACIÓN DE SISTEMAS Y SOLUCIONES DE INTELIGENCIA DE NEGOCIOS PARA LA TRANSFORMACIÓN DIGITAL","PROFESIONAL TÉCNICO"]
["SPT24X0415","ADMINISTRACIÓN E INNOVACIÓN PARA LOS NEGOCIOS","PROFESIONAL TÉCNICO"]
["SPT4131107","ADMINISTRACIÓN EJECUTIVA","PROFESIONAL TÉCNICO"]
["SPT4130154","ADMINISTRACIÓN EMPRESARIAL","PROFESIONAL TÉCNICO"]
["SPT4110133","ADMINISTRACIÓN FINANCIERA Y CONTABLE","PROFESIONAL TÉCNICO"]
["SPT0120039","ADMINISTRACIÓN HOSTELERA","PROFESIONAL TÉCNICO"]
["SPT0121128","ADMINISTRACIÓN HOTELERA","PROFESIONAL TÉCNICO"]
["SPT4131108","ADMINISTRACIÓN INDUSTRIAL","PROFESIONAL TÉCNICO"]
["SPT6121186","ADMINISTRACIÓN INFORMÁTICA DE EMPRESAS","PROFESIONAL TÉCNICO"]
["SPT4131109","ADMINISTRACIÓN LOGÍSTICA","PROFESIONAL TÉCNICO"]
["SPT0310093","ADMINISTRACIÓN MILITAR","PROFESIONAL TÉCNICO"]
["SPT4171110","ADMINISTRACIÓN MUNICIPAL","PROFESIONAL TÉCNICO"]
["SPT0310100","ADMINISTRACIÓN NAVAL","PROFESIONAL TÉCNICO"]
["SPT4131095","ADMINISTRACIÓN","PROFESIONAL TÉCNICO"]
["SPT4170045","ADMINISTRACIÓN PÚBLICA","PROFESIONAL TÉCNICO"]
["SPT4131302","ADMINISTRACIÓN RURAL","PROFESIONAL TÉCNICO"]
["SPT0120026","ADMINISTRACIÓN TURÍSTICA","PROFESIONAL TÉCNICO"]
["SPT0120046","ADMINISTRACIÓN TURÍSTICA Y HOTELERA","PROFESIONAL TÉCNICO"]
["SPT0321362","ADMINISTRACIÓN Y CIENCIAS POLICIALES","PROFESIONAL TÉCNICO"]
["SPT4110155","ADMINISTRACIÓN Y CONTABILIDAD","PROFESIONAL TÉCNICO"]
["SPT4131113","ADMINISTRACIÓN Y FINANZAS","PROFESIONAL TÉCNICO"]
["SPT0121129","ADMINISTRACIÓN Y GERENCIA EN HOTELERÍA INTERNACIONAL","PROFESIONAL TÉCNICO"]
["SPT4136554","ADMINISTRACIÓN Y GESTIÓN COMERCIAL CON MENCIÓN EN FINANZAS","PROFESIONAL TÉCNICO"]
["SPT4136555","ADMINISTRACIÓN Y GESTIÓN COMERCIAL CON MENCIÓN EN RECURSOS HUMANOS","PROFESIONAL TÉCNICO"]
["SPT4131111","ADMINISTRACIÓN Y GESTIÓN COMERCIAL","PROFESIONAL TÉCNICO"]
["SPT4130167","ADMINISTRACIÓN Y GESTIÓN DE EMPRESAS","PROFESIONAL TÉCNICO"]
["SPT4131112","ADMINISTRACIÓN Y GESTIÓN EMPRESARIAL","PROFESIONAL TÉCNICO"]
["SPT4131187","ADMINISTRACIÓN Y SISTEMAS","PROFESIONAL TÉCNICO"]
["SPT4131160","ADMINISTRATIVO","PROFESIONAL TÉCNICO"]
["SPT7321281","AEROFOTOGRAFÍA","PROFESIONAL TÉCNICO"]
["SPT7141240","AERONÁUTICA","PROFESIONAL TÉCNICO"]
["SPT4181161","AGENCIA DE DESARROLLO INTEGRAL","PROFESIONAL TÉCNICO"]
["SPT8111223","AGROINDUSTRIAS","PROFESIONAL TÉCNICO"]
["SPT8110104","AGRONOMÍA","PROFESIONAL TÉCNICO"]
["SPT8111303","AGROPECUARIA","PROFESIONAL TÉCNICO"]
["SPT6121188","ANÁLISIS DE SISTEMAS","PROFESIONAL TÉCNICO"]
["SPT6121189","ANÁLISIS DE SISTEMAS Y MODELACIÓN DE BASE DE DATOS","PROFESIONAL TÉCNICO"]
["SPT7320025","ANÁLISIS DE SUELOS Y CONCRETO","PROFESIONAL TÉCNICO"]
["SPT6120085","ANÁLISIS E IMPLEMENTACIÓN DE SERVICIOS WEB","PROFESIONAL TÉCNICO"]
["SPT3111167","ANÁLISIS ECONÓMICO","PROFESIONAL TÉCNICO"]
["SPT3121178","ANÁLISIS POLÍTICO","PROFESIONAL TÉCNICO"]
["SPT5311182","ANÁLISIS QUÍMICO","PROFESIONAL TÉCNICO"]
["SPT4110622","ANALISTA BANCARIO","PROFESIONAL TÉCNICO"]
["SPT4114019","ANALISTA COMERCIAL","PROFESIONAL TÉCNICO"]
["SPT4111818","ANALISTA DE RIESGOS","PROFESIONAL TÉCNICO"]
["SPT3110188","ANALISTA ECONÓMICO","PROFESIONAL TÉCNICO"]
["SPT4111515","ANALISTA EN MERCADOTÉCNIA","PROFESIONAL TÉCNICO"]
["SPT5421479","ANALISTA ESTADÍSTICO","PROFESIONAL TÉCNICO"]
["SPT7324248","ANALISTA INMOBILIARIO","PROFESIONAL TÉCNICO"]
["SPT3120189","ANALISTA POLÍTICO","PROFESIONAL TÉCNICO"]
["SPT6121190","ANALISTA","PROFESIONAL TÉCNICO"]
["SPT6121191","ANALISTA PROGRAMADOR","PROFESIONAL TÉCNICO"]
["SPT5426592","ANALÍTICA","PROFESIONAL TÉCNICO"]
["SPT9120113","ANESTESIA","PROFESIONAL TÉCNICO"]
["SPT9121320","ANESTESIOLOGÍA","PROFESIONAL TÉCNICO"]
["SPT2116066","ANIMACIÓN 3D Y EFECTOS ESPECIALES","PROFESIONAL TÉCNICO"]
["SPT6116144","ANIMACIÓN 3D Y EFECTOS VISUALES","PROFESIONAL TÉCNICO"]
["SPT2111035","ANIMACIÓN DIGITAL","PROFESIONAL TÉCNICO"]
["SPT6116556","ANIMACIÓN DIGITAL Y DISEÑO 3D","PROFESIONAL TÉCNICO"]
["SPT3231027","ARCHIVOS","PROFESIONAL TÉCNICO"]
["SPT0311350","ARMAS SUBMARINAS","PROFESIONAL TÉCNICO"]
["SPT6116557","ARQUITECTURA DE DATOS EMPRESARIALES CON MENCIÓN EN BIG DATA DEVELOPER","PROFESIONAL TÉCNICO"]
["SPT7311291","ARQUITECTURA DE INTERIORES","PROFESIONAL TÉCNICO"]
["SPT6116107","ARQUITECTURA DE PLATAFORMA Y SERVICIOS DE TECNOLOGÍAS DE LA INFORMACIÓN","PROFESIONAL TÉCNICO"]
["SPT6116149","ARQUITECTURA DE PLATAFORMAS Y SERVICIOS DE TECNOLOGÍA DE LA INFORMACION CON MENCIÓN EN PROGRAMACIÓN","PROFESIONAL TÉCNICO"]
["SPT6116558","ARQUITECTURA DE PLATAFORMAS Y SERVICIOS DE TECNOLOGÍAS DE LA INFORMACIÓN CON MENCIÓN EN PROGRAMAS MULTIMEDIA","PROFESIONAL TÉCNICO"]
["SPT6116176","ARQUITECTURA DE PLATAFORMAS Y SERVICIOS DE TECNOLOGÍAS DE LA INFORMACIÓN","PROFESIONAL TÉCNICO"]
["SPT6120125","ARQUITECTURA DE SISTEMAS DE INFORMACIÓN","PROFESIONAL TÉCNICO"]
["SPT0120159","ARTE CULINARIO","PROFESIONAL TÉCNICO"]
["SPT2151065","ARTE DRAMÁTICO","PROFESIONAL TÉCNICO"]
["SPT2111036","ARTES GRÁFICAS","PROFESIONAL TÉCNICO"]
["SPT2111037","ARTES GRÁFICAS Y PUBLICITARIAS","PROFESIONAL TÉCNICO"]
["SPT2131032","ARTES PLÁSTICAS Y VISUALES","PROFESIONAL TÉCNICO"]
["SPT2130064","ARTES VISUALES","PROFESIONAL TÉCNICO"]
["SPT2111038","ARTES Y CIENCIAS PUBLICITARIAS","PROFESIONAL TÉCNICO"]
["SPT2130120","ARTESANÍA","PROFESIONAL TÉCNICO"]
["SPT0311351","ARTILLERÍA","PROFESIONAL TÉCNICO"]
["SPT8310025","ASEGURAMIENTO DE LA CALIDAD DE PRODUCTOS HIDROBIOLÓGICOS","PROFESIONAL TÉCNICO"]
["SPT4136161","ASISTENCIA ADMINISTRATIVA","PROFESIONAL TÉCNICO"]
["SPT4156123","ASISTENCIA DE DIRECCIÓN Y GERENCIA","PROFESIONAL TÉCNICO"]
["SPT4156127","ASISTENTE EJECUTIVA DE GERENCIA","PROFESIONAL TÉCNICO"]
["SPT4151152","ASISTENTE EJECUTIVO","PROFESIONAL TÉCNICO"]
["SPT2111091","AUDIOVISUAL MULTIMEDIA","PROFESIONAL TÉCNICO"]
["SPT7141241","AUTOTRÓNICA","PROFESIONAL TÉCNICO"]
["SPT9131325","AUXILIAR DE ENFERMERÍA","PROFESIONAL TÉCNICO"]
["SPT7141242","AVIÓNICA","PROFESIONAL TÉCNICO"]
["SPT7146559","AVIÓNICA Y MECÁNICA AERONAÚTICA","PROFESIONAL TÉCNICO"]
["SPT4111170","BANCA Y FINANZAS","PROFESIONAL TÉCNICO"]
["SPT6116166","BIG DATA Y CIENCIA DE DATOS","PROFESIONAL TÉCNICO"]
["SPT2111092","CÁMARA Y EDICIÓN CREATIVA","PROFESIONAL TÉCNICO"]
["SPT0311352","CAPITANÍA Y GUARDACOSTAS","PROFESIONAL TÉCNICO"]
["SPT0316160","CAPITANÍAS Y GUARDACOSTAS","PROFESIONAL TÉCNICO"]
["SPT24X0406","CIENCIA DE DATOS E INTELIGENCIA ARTIFICIAL","PROFESIONAL TÉCNICO"]
["SPT0326087","CIENCIAS ADMINISTRATIVAS Y POLICIALES CON MENCIÓN EN INVESTIGACIÓN CRIMINAL","PROFESIONAL TÉCNICO"]
["SPT0326088","CIENCIAS ADMINISTRATIVAS Y POLICIALES CON MENCIÓN EN ORDEN Y SEGURIDAD","PROFESIONAL TÉCNICO"]
["SPT0320226","CIENCIAS ADMINISTRATIVAS Y POLICIALES","PROFESIONAL TÉCNICO"]
["SPT8110716","CIENCIAS AGROPECUARIAS","PROFESIONAL TÉCNICO"]
["SPT24X0429","CIENCIAS AGROPECUARIAS","PROFESIONAL TÉCNICO"]
["SPT3221072","CIENCIAS DE LA COMUNICACIÓN","PROFESIONAL TÉCNICO"]
["SPT2111039","CIENCIAS PUBLICITARIAS","PROFESIONAL TÉCNICO"]
["SPT2156560","CINEMATOGRAFIA","PROFESIONAL TÉCNICO"]
["SPT2110105","CINEMATOGRAFÍA","PROFESIONAL TÉCNICO"]
["SPT0121130","COCINA","PROFESIONAL TÉCNICO"]
["SPT4161148","COMERCIO EXTERIOR ÁREA ARTESANÍA DEL VESTIR","PROFESIONAL TÉCNICO"]
["SPT4161149","COMERCIO EXTERIOR ÁREA FINANZAS","PROFESIONAL TÉCNICO"]
["SPT4161150","COMERCIO EXTERIOR ÁREA MARKETING","PROFESIONAL TÉCNICO"]
["SPT4161147","COMERCIO EXTERIOR","PROFESIONAL TÉCNICO"]
["SPT4181162","COMERCIO","PROFESIONAL TÉCNICO"]
["SPT2151057","COMPOSICIÓN","PROFESIONAL TÉCNICO"]
["SPT24X0426","COMPUTACIÓN E INFORMÁTICA DOCENTE","PROFESIONAL TÉCNICO"]
["SPT6111193","COMPUTACIÓN E INFORMÁTICA","PROFESIONAL TÉCNICO"]
["SPT6111192","COMPUTACIÓN","PROFESIONAL TÉCNICO"]
["SPT6121194","COMPUTACIÓN Y ADMINISTRACIÓN DE SISTEMAS","PROFESIONAL TÉCNICO"]
["SPT6121195","COMPUTACIÓN Y SISTEMAS","PROFESIONAL TÉCNICO"]
["SPT6110051","COMPUTACIÓN Y SOLUCIONES INFORMÁTICAS","PROFESIONAL TÉCNICO"]
["SPT24X0421","CÓMPUTO E INFORMÁTICA","PROFESIONAL TÉCNICO"]
["SPT3220817","COMUNICACIÓN","PROFESIONAL TÉCNICO"]
["SPT3221074","COMUNICACIÓN AUDIOVISUAL MULTIMEDIA","PROFESIONAL TÉCNICO"]
["SPT3221073","COMUNICACIÓN AUDIOVISUAL","PROFESIONAL TÉCNICO"]
["SPT24X0402","COMUNICACIÓN CORPORATIVA Y RELACIONES PUBLICAS","PROFESIONAL TÉCNICO"]
["SPT3221075","COMUNICACIÓN ESCÉNICA","PROFESIONAL TÉCNICO"]
["SPT3220918","COMUNICACIÓN ESTRATÉGICA","PROFESIONAL TÉCNICO"]
["SPT3221076","COMUNICACIÓN INTEGRAL","PROFESIONAL TÉCNICO"]
["SPT3226134","COMUNICACIÓN PERIODÍSTICA","PROFESIONAL TÉCNICO"]
["SPT3221077","COMUNICACIÓN SOCIAL","PROFESIONAL TÉCNICO"]
["SPT3226113","COMUNICACIÓN Y ARTE DIGITAL","PROFESIONAL TÉCNICO"]
["SPT3226561","COMUNICACIÓN Y MARKETING DE LA MODA","PROFESIONAL TÉCNICO"]
["SPT7241264","CONCENTRACIÓN DE MINERALES","PROFESIONAL TÉCNICO"]
["SPT8311295","CONDUCCIÓN DE EMBARCACIONES DE PESCA","PROFESIONAL TÉCNICO"]
["SPT0141338","CONDUCCIÓN EN TURISMO","PROFESIONAL TÉCNICO"]
["SPT2221292","CONSERVACIÓN DE BIENES ARQUEOLÓGICOS","PROFESIONAL TÉCNICO"]
["SPT2131293","CONSERVACIÓN Y RESTAURACIÓN","PROFESIONAL TÉCNICO"]
["SPT7320041","CONSTRUCCIÓN ARTÍSTICA EN MADERA","PROFESIONAL TÉCNICO"]
["SPT9999003","CONSTRUCCION CIVIL","PROFESIONAL TÉCNICO"]
["SPT7321282","CONSTRUCCIÓN CIVIL","PROFESIONAL TÉCNICO"]
["SPT2131033","CONSTRUCCIÓN DE ARTE EN MADERA","PROFESIONAL TÉCNICO"]
["SPT7320213","CONSTRUCCIÓN Y TOPOGRAFÍA","PROFESIONAL TÉCNICO"]
["SPT2140028","CONSTRUCCIONES ARTÍSTICAS EN MADERA","PROFESIONAL TÉCNICO"]
["SPT7130200","CONSTRUCCIONES METÁLICAS","PROFESIONAL TÉCNICO"]
["SPT9999004","CONTABILIDAD","PROFESIONAL TÉCNICO"]
["SPT4111172","CONTABILIDAD COMPUTARIZADA","PROFESIONAL TÉCNICO"]
["SPT4116124","CONTABILIDAD CON MENCIÓN EN FINANZAS","PROFESIONAL TÉCNICO"]
["SPT4116150","CONTABILIDAD CON MENCIÓN EN PROCESOS DE TRIBUTACIÓN","PROFESIONAL TÉCNICO"]
["SPT4116598","CONTABILIDAD CON MENCIÓN EN TRIBUTACIÓN","PROFESIONAL TÉCNICO"]
["SPT4111171","CONTABILIDAD","PROFESIONAL TÉCNICO"]
["SPT4116562","CONTABILIDAD Y AUDITORÍA","PROFESIONAL TÉCNICO"]
["SPT4116563","CONTABILIDAD Y FINANZAS CORPORATIVAS","PROFESIONAL TÉCNICO"]
["SPT4111173","CONTABILIDAD Y FINANZAS","PROFESIONAL TÉCNICO"]
["SPT4116564","CONTABILIDAD Y TRIBUTACIÓN","PROFESIONAL TÉCNICO"]
["SPT4110056","CONTABILIDAD, FINANZAS Y AUDITORÍA","PROFESIONAL TÉCNICO"]
["SPT24X0446","CONTROL DE CALIDAD Y ACABADOS EN HILADOS","PROFESIONAL TÉCNICO"]
["SPT0316156","CONTROL DE TIRO","PROFESIONAL TÉCNICO"]
["SPT6131210","CONTROL DE TRÁNSITO AÉREO","PROFESIONAL TÉCNICO"]
["SPT7120015","CONTROLISTA DE MÁQUINAS Y PROCESOS INDUSTRIALES","PROFESIONAL TÉCNICO"]
["SPT0111349","COSMÉTICA DERMATOLÓGICA","PROFESIONAL TÉCNICO"]
["SPT0110025","COSMETOLOGÍA","PROFESIONAL TÉCNICO"]
["SPT0116109","COSMIATRÍA","PROFESIONAL TÉCNICO"]
["SPT4111174","CRÉDITO SECTORIAL","PROFESIONAL TÉCNICO"]
["SPT4111175","CRÉDITOS","PROFESIONAL TÉCNICO"]
["SPT9131326","CUIDADOS AUXILIARES DE ENFERMERÍA","PROFESIONAL TÉCNICO"]
["SPT2151055","DANZA","PROFESIONAL TÉCNICO"]
["SPT0311353","DEFENSA AÉREA","PROFESIONAL TÉCNICO"]
["SPT6110153","DESARROLLO DE REDES Y GESTIÓN DE SERVICIOS","PROFESIONAL TÉCNICO"]
["SPT6121019","DESARROLLO DE SISTEMAS DE INFORMACIÓN CON MENCIÓN AUDITOR DE SISTEMAS DE INFORMACIÓN","PROFESIONAL TÉCNICO"]
["SPT24X0420","DESARROLLO DE SISTEMAS DE INFORMACIÓN CON MENCIÓN AUDITOR DE SISTEMAS DE INFORMACIÓN","PROFESIONAL TÉCNICO"]
["SPT7126588","DESARROLLO DE SISTEMAS DE INFORMACIÓN CON MENCIÓN EN APLICATIVOS MÓVILES","PROFESIONAL TÉCNICO"]
["SPT7126587","DESARROLLO DE SISTEMAS DE INFORMACIÓN CON MENCIÓN EN INTELIGENCIA DE NEGOCIOS","PROFESIONAL TÉCNICO"]
["SPT7126148","DESARROLLO DE SISTEMAS DE INFORMACIÓN CON MENCIÓN EN PROCESOS DE AUTOMATIZACIÓN","PROFESIONAL TÉCNICO"]
["SPT6110220","DESARROLLO DE SISTEMAS DE INFORMACIÓN MENCIÓN EN SEGURIDAD INFORMÁTICA","PROFESIONAL TÉCNICO"]
["SPT6110221","DESARROLLO DE SISTEMAS DE INFORMACIÓN MENCIÓN EN SOFTWARE EMPRESARIAL","PROFESIONAL TÉCNICO"]
["SPT6116085","DESARROLLO DE SISTEMAS DE INFORMACIÓN","PROFESIONAL TÉCNICO"]
["SPT6121120","DESARROLLO DE SISTEMAS DE LA INFORMACIÓN","PROFESIONAL TÉCNICO"]
["SPT6116164","DESARROLLO DE SISTEMAS DE LA INFORMACIÓN","PROFESIONAL TÉCNICO"]
["SPT6110182","DESARROLLO DE SOFTWARE E INTELIGENCIA DE NEGOCIOS","PROFESIONAL TÉCNICO"]
["SPT6110151","DESARROLLO DE SOFTWARE E INTELIGENCIA DE NEGOCIOS","PROFESIONAL TÉCNICO"]
["SPT6120165","DESARROLLO DE SOFTWARE","PROFESIONAL TÉCNICO"]
["SPT6110156","DESARROLLO DE SOFTWARE Y APLICATIVOS MÓVILES","PROFESIONAL TÉCNICO"]
["SPT8311221","DESARROLLO PESQUERO Y ACUÍCOLA","PROFESIONAL TÉCNICO"]
["SPT24X0410","DESARROLLO PESQUERO Y ACUICOLA","PROFESIONAL TÉCNICO"]
["SPT24X0409","DESARROLLO PESQUERO Y ACUÍCOLA","PROFESIONAL TÉCNICO"]
["SPT7320071","DIBUJO DE ARQUITECTURA Y OBRAS CIVILES","PROFESIONAL TÉCNICO"]
["SPT7326172","DIBUJO DE LA ARQUITECTURA Y OBRAS CIVILES","PROFESIONAL TÉCNICO"]
["SPT7321283","DIBUJO EN CONSTRUCCIÓN CIVIL","PROFESIONAL TÉCNICO"]
["SPT24X0460","DIRECCIÓN DE AGRUPACIONES MUSICALES","PROFESIONAL TÉCNICO"]
["SPT6116115","DIRECCIÓN DE ANIMACIÓN 3D Y VFX","PROFESIONAL TÉCNICO"]
["SPT2110145","DIRECCIÓN DE ARTES GRÁFICAS Y PUBLICITARIAS","PROFESIONAL TÉCNICO"]
["SPT4181114","DIRECCIÓN DE EMPRESAS","PROFESIONAL TÉCNICO"]
["SPT4181115","DIRECCIÓN DE EMPRESAS Y FINANZAS","PROFESIONAL TÉCNICO"]
["SPT2111322","DIRECCIÓN DE PROYECTOS VISUALES Y FOTOGRAFÍA","PROFESIONAL TÉCNICO"]
["SPT2151058","DIRECCIÓN MUSICAL","PROFESIONAL TÉCNICO"]
["SPT0130194","DIRECCIÓN TÉCNICA EN FÚTBOL","PROFESIONAL TÉCNICO"]
["SPT2111041","DIRECCIÓN Y DISEÑO GRÁFICO","PROFESIONAL TÉCNICO"]
["SPT2111042","DIRECCIÓN Y DISEÑO PUBLICITARIO","PROFESIONAL TÉCNICO"]
["SPT3221078","DIRECCIÓN Y GUIONIZACIÓN","PROFESIONAL TÉCNICO"]
["SPT3221079","DIRECCIÓN Y PRODUCCIÓN EN RADIO","PROFESIONAL TÉCNICO"]
["SPT3220164","DIRECCIÓN Y REALIZACIÓN DE CINE Y TELEVISIÓN","PROFESIONAL TÉCNICO"]
["SPT3221080","DIRECCIÓN, REALIZACIÓN DE CINE Y TV","PROFESIONAL TÉCNICO"]
["SPT2120191","DISEÑO DE AMBIENTES","PROFESIONAL TÉCNICO"]
["SPT7130015","DISEÑO DE ESTRUCTURAS METÁLICAS Y DE CONSTRUCCIÓN","PROFESIONAL TÉCNICO"]
["SPT2121043","DISEÑO DE INTERIORES","PROFESIONAL TÉCNICO"]
["SPT2116565","DISEÑO DE MEDIOS INTERACTIVOS","PROFESIONAL TÉCNICO"]
["SPT2121271","DISEÑO DE MODAS","PROFESIONAL TÉCNICO"]
["SPT2121272","DISEÑO DE MODAS Y MODISTERÍA INDUSTRIAL","PROFESIONAL TÉCNICO"]
["SPT2126103","DISEÑO DE PRENDAS DE VESTIR","PROFESIONAL TÉCNICO"]
["SPT2121423","DISEÑO DE PRODUCCIÓN E INNOVACIÓN TECNOLÓGICA","PROFESIONAL TÉCNICO"]
["SPT2121044","DISEÑO DE PRODUCTO","PROFESIONAL TÉCNICO"]
["SPT2130060","DISEÑO DE PRODUCTO Y ANIMACIÓN DIGITAL","PROFESIONAL TÉCNICO"]
["SPT2120075","DISEÑO DE PRODUCTOS DE MADERA","PROFESIONAL TÉCNICO"]
["SPT6110214","DISEÑO DE SOFTWARE E INTEGRACIÓN DE SISTEMAS","PROFESIONAL TÉCNICO"]
["SPT2110217","DISEÑO DE VIDEO JUEGOS Y ENTRETENIMIENTO DIGITAL","PROFESIONAL TÉCNICO"]
["SPT2110078","DISEÑO DE VIDEO JUEGOS","PROFESIONAL TÉCNICO"]
["SPT24X0416","DISEÑO DE VIDEOJUEGOS Y ENTRETENIMIENTO DIGITAL","PROFESIONAL TÉCNICO"]
["SPT2130059","DISEÑO E INNOVACIÓN INDUSTRIAL","PROFESIONAL TÉCNICO"]
["SPT2121045","DISEÑO ESCENOGRÁFICO","PROFESIONAL TÉCNICO"]
["SPT4146566","DISEÑO ESTRATÉGICO PARA LOS NEGOCIOS","PROFESIONAL TÉCNICO"]
["SPT2110225","DISEÑO GRÁFICO DIGITAL","PROFESIONAL TÉCNICO"]
["SPT2111046","DISEÑO GRAFICO","PROFESIONAL TÉCNICO"]
["SPT2136567","DISEÑO GRÁFICO PUBLICITARIO","PROFESIONAL TÉCNICO"]
["SPT24X0418","DISEÑO GRÁFICO VISUAL","PROFESIONAL TÉCNICO"]
["SPT2130085","DISEÑO GRÁFICO Y MULTIMEDIA","PROFESIONAL TÉCNICO"]
["SPT2111047","DISEÑO GRÁFICO Y PUBLICIDAD DIGITAL","PROFESIONAL TÉCNICO"]
["SPT2111048","DISEÑO GRÁFICO Y PUBLICITARIO","PROFESIONAL TÉCNICO"]
["SPT2121049","DISEÑO INDUSTRIAL","PROFESIONAL TÉCNICO"]
["SPT2111050","DISEÑO PUBLICITARIO","PROFESIONAL TÉCNICO"]
["SPT2111051","DISEÑO TÉCNICO","PROFESIONAL TÉCNICO"]
["SPT7231273","DISEÑO TEXTIL","PROFESIONAL TÉCNICO"]
["SPT2111524","DISEÑO WEB & MULTIMEDIA","PROFESIONAL TÉCNICO"]
["SPT2111052","DISEÑO WEB Y MULTIMEDIA","PROFESIONAL TÉCNICO"]
["SPT2130086","DISEÑO Y DECORACIÓN DE INTERIORES","PROFESIONAL TÉCNICO"]
["SPT2116600","DISEÑO Y DESARROLLO DE SIMULADORES Y VIDEOJUEGOS","PROFESIONAL TÉCNICO"]
["SPT6126541","DISEÑO Y DESARROLLO DE SOFTWARE","PROFESIONAL TÉCNICO"]
["SPT6126568","DISEÑO Y DESARROLLO DE SOFTWARE Y PRUEBAS DE SOLUCIONES MULTIPLATAFORMA","PROFESIONAL TÉCNICO"]
["SPT6126569","DISEÑO Y DESARROLLO DE SOFTWARE Y SOLUCIONES DE INTELIGENCIA DE NEGOCIOS","PROFESIONAL TÉCNICO"]
["SPT6126570","DISEÑO Y DESARROLLO DE SOFTWARE Y SOLUCIONES MÓVILES","PROFESIONAL TÉCNICO"]
["SPT6126571","DISEÑO Y DESARROLLO DE SOFTWARE Y SOLUCIONES WEB","PROFESIONAL TÉCNICO"]
["SPT6126572","DISEÑO Y DESARROLLO DE SOFTWARE Y TÉCNICAS DE HACKING ÉTICO","PROFESIONAL TÉCNICO"]
["SPT2110143","DISEÑO Y DESARROLLO DE VIDEO JUEGOS","PROFESIONAL TÉCNICO"]
["SPT2110216","DISEÑO Y DESARROLLO PARA MEDIOS DIGITALES","PROFESIONAL TÉCNICO"]
["SPT6120185","DISEÑO Y DESARROLLO WEB","PROFESIONAL TÉCNICO"]
["SPT2121625","DISEÑO Y FABRICACIÓN DE CALZADO","PROFESIONAL TÉCNICO"]
["SPT24X0425","DISEÑO Y FABRICACIÓN DE CALZADO","PROFESIONAL TÉCNICO"]
["SPT24X0447","DISEÑO Y FABRICACIÓN DE PRODUCTOS DE CUERO","PROFESIONAL TÉCNICO"]
["SPT2120180","DISEÑO Y GESTIÓN DE LA MODA","PROFESIONAL TÉCNICO"]
["SPT7231274","DISEÑO Y PRODUCCIÓN DE TEXTILES","PROFESIONAL TÉCNICO"]
["SPT7230084","DISEÑO Y PRODUCCIÓN TEXTIL","PROFESIONAL TÉCNICO"]
["SPT6116079","DISEÑO Y PROGRAMACIÓN WEB","PROFESIONAL TÉCNICO"]
["SPT1310116","EBANISTERÍA","PROFESIONAL TÉCNICO"]
["SPT0141339","ECOLOGÍA TURÍSTICA","PROFESIONAL TÉCNICO"]
["SPT3111168","ECONOMÍA EMPRESARIAL","PROFESIONAL TÉCNICO"]
["SPT0141131","ECOTURISMO Y GESTIÓN AMBIENTAL","PROFESIONAL TÉCNICO"]
["SPT7321284","EDIFICACIONES","PROFESIONAL TÉCNICO"]
["SPT9999005","EDIFICACIONES Y OBRAS CIVILES","PROFESIONAL TÉCNICO"]
["SPT1611017","EDUCACIÓN ARTÍSTICA","PROFESIONAL TÉCNICO"]
["SPT1991022","EDUCACIÓN BÁSICA ALTERNATIVA","PROFESIONAL TÉCNICO"]
["SPT1611018","EDUCACIÓN DANZA","PROFESIONAL TÉCNICO"]
["SPT1211005","EDUCACIÓN EN COMPUTACIÓN E INFORMÁTICA","PROFESIONAL TÉCNICO"]
["SPT1611019","EDUCACIÓN EN DANZA CLÁSICA","PROFESIONAL TÉCNICO"]
["SPT1211006","EDUCACIÓN EN IDIOMAS - INGLÉS","PROFESIONAL TÉCNICO"]
["SPT1411015","EDUCACIÓN ESPECIAL AUDICIÓN","PROFESIONAL TÉCNICO"]
["SPT1411016","EDUCACIÓN ESPECIAL RETARDO","PROFESIONAL TÉCNICO"]
["SPT1511014","EDUCACIÓN FÍSICA","PROFESIONAL TÉCNICO"]
["SPT1111002","EDUCACIÓN INICIAL (INTERCULTURAL Y BILINGÜE)","PROFESIONAL TÉCNICO"]
["SPT1111001","EDUCACIÓN INICIAL","PROFESIONAL TÉCNICO"]
["SPT1611020","EDUCACIÓN MUSICAL","PROFESIONAL TÉCNICO"]
["SPT1211007","EDUCACIÓN PARA EL TRABAJO","PROFESIONAL TÉCNICO"]
["SPT1121004","EDUCACIÓN PRIMARIA (INTERCULTURAL Y BILINGÜE)","PROFESIONAL TÉCNICO"]
["SPT1121003","EDUCACIÓN PRIMARIA","PROFESIONAL TÉCNICO"]
["SPT1211008","EDUCACIÓN RELIGIOSA","PROFESIONAL TÉCNICO"]
["SPT1211009","EDUCACIÓN SECUNDARIA - CIENCIA, TECNOLOGÍA Y AMBIENTE","PROFESIONAL TÉCNICO"]
["SPT1211010","EDUCACIÓN SECUNDARIA - CIENCIAS SOCIALES","PROFESIONAL TÉCNICO"]
["SPT1211011","EDUCACIÓN SECUNDARIA - COMUNICACIÓN","PROFESIONAL TÉCNICO"]
["SPT1211012","EDUCACIÓN SECUNDARIA - MATEMÁTICA","PROFESIONAL TÉCNICO"]
["SPT1211013","EDUCACIÓN SECUNDARIA TÉCNICA","PROFESIONAL TÉCNICO"]
["SPT3111169","ELABORACIÓN Y EVALUACIÓN DE PROYECTOS","PROFESIONAL TÉCNICO"]
["SPT7116083","ELECTRICIDAD INDUSTRIAL CON MENCIÓN EN SERVICIO NAVAL","PROFESIONAL TÉCNICO"]
["SPT7116589","ELECTRICIDAD INDUSTRIAL CON MENCIÓN EN SISTEMAS ELÉCTRICOS DE POTENCIA","PROFESIONAL TÉCNICO"]
["SPT7111227","ELECTRICIDAD INDUSTRIAL","PROFESIONAL TÉCNICO"]
["SPT7111226","ELECTRICIDAD","PROFESIONAL TÉCNICO"]
["SPT7110025","ELECTRICISTA INDUSTRIAL","PROFESIONAL TÉCNICO"]
["SPT7121231","ELECTRÓNICA AERONÁUTICA","PROFESIONAL TÉCNICO"]
["SPT7126170","ELECTRÓNICA CON MENCIÓN EN SERVICIO NAVAL","PROFESIONAL TÉCNICO"]
["SPT7121232","ELECTRÓNICA DE MICROCOMPUTADORAS","PROFESIONAL TÉCNICO"]
["SPT7121237","ELECTRÓNICA DE SISTEMAS COMPUTARIZADOS","PROFESIONAL TÉCNICO"]
["SPT7121233","ELECTRÓNICA DE SISTEMAS INDUSTRIALES","PROFESIONAL TÉCNICO"]
["SPT7121234","ELECTRÓNICA DIGITAL","PROFESIONAL TÉCNICO"]
["SPT7126125","ELECTRÓNICA INDUSTRIAL CON MENCIÓN EN AUTOMATIZACIÓN Y CONTROL INDUSTRIAL","PROFESIONAL TÉCNICO"]
["SPT7121235","ELECTRÓNICA INDUSTRIAL","PROFESIONAL TÉCNICO"]
["SPT7121230","ELECTRÓNICA","PROFESIONAL TÉCNICO"]
["SPT7121236","ELECTRÓNICA Y AUTOMATIZACIÓN INDUSTRIAL","PROFESIONAL TÉCNICO"]
["SPT7120145","ELECTRÓNICO INDUSTRIAL","PROFESIONAL TÉCNICO"]
["SPT7126126","ELECTROTÉCNIA INDUSTRIAL CON MENCIÓN EN ENERGIA RENOVABLES EN EFICIENCIA ENERGÉTICA","PROFESIONAL TÉCNICO"]
["SPT7126586","ELECTROTECNIA INDUSTRIAL CON MENCIÓN EN ENERGÍA RENOVABLES Y EFICIENCIA ENERGÉTICA","PROFESIONAL TÉCNICO"]
["SPT7121228","ELECTROTECNIA INDUSTRIAL","PROFESIONAL TÉCNICO"]
["SPT7120109","ELECTROTECNIA","PROFESIONAL TÉCNICO"]
["SPT9999006","ENFERMERIA","PROFESIONAL TÉCNICO"]
["SPT9130161","ENFERMERÍA PEDIÁTRICA","PROFESIONAL TÉCNICO"]
["SPT9130036","ENFERMERÍA","PROFESIONAL TÉCNICO"]
["SPT9130044","ENFERMERÍA TÉCNICA INTERCULTURAL BILINGÜE AMAZÓNICA","PROFESIONAL TÉCNICO"]
["SPT9131327","ENFERMERIA TÉCNICA","PROFESIONAL TÉCNICO"]
["SPT24X0428","ENFERMERÍA TÉCNICA Y SALUD INTERCULTURAL AMAZÓNICA","PROFESIONAL TÉCNICO"]
["SPT0136128","ENTRENAMIENTO DEPORTIVO","PROFESIONAL TÉCNICO"]
["SPT0116078","ESTÉTICA, IMAGEN Y ESTILO","PROFESIONAL TÉCNICO"]
["SPT24X0419","ESTETICISMO","PROFESIONAL TÉCNICO"]
["SPT7246179","EXPLORACIÓN Y EXPLOTACIÓN MINERA","PROFESIONAL TÉCNICO"]
["SPT7240027","EXPLOTACIÓN DE MINAS","PROFESIONAL TÉCNICO"]
["SPT7241265","EXPLOTACIÓN MINERA","PROFESIONAL TÉCNICO"]
["SPT9171336","FARMACIA","PROFESIONAL TÉCNICO"]
["SPT9999007","FARMACIA TÉCNICA -DUAL","PROFESIONAL TÉCNICO"]
["SPT9170148","FARMACIA TÉCNICA","PROFESIONAL TÉCNICO"]
["SPT4111176","FINANZAS","PROFESIONAL TÉCNICO"]
["SPT9160195","FISIOTERAPIA Y REHABILITACIÓN FÍSICA","PROFESIONAL TÉCNICO"]
["SPT9161329","FISIOTERAPIA Y REHABILITACIÓN","PROFESIONAL TÉCNICO"]
["SPT8211318","FORESTAL (PARA ZONA DE SELVA)","PROFESIONAL TÉCNICO"]
["SPT8211317","FORESTAL","PROFESIONAL TÉCNICO"]
["SPT8210163","FORESTALES","PROFESIONAL TÉCNICO"]
["SPT4110136","FORMACIÓN BANCARIA","PROFESIONAL TÉCNICO"]
["SPT2110197","FOTOGRAFÍA E IMAGEN DIGITAL","PROFESIONAL TÉCNICO"]
["SPT2111093","FOTOGRAFÍA","PROFESIONAL TÉCNICO"]
["SPT2116574","FOTOGRAFÍA Y PRODUCCIÓN DE IMAGEN","PROFESIONAL TÉCNICO"]
["SPT8111304","FRUTICULTURA","PROFESIONAL TÉCNICO"]
["SPT8111305","FRUTICULTURA Y OLIVICULTURA","PROFESIONAL TÉCNICO"]
["SPT0311354","FUERZAS ESPECIALES","PROFESIONAL TÉCNICO"]
["SPT7211220","GASTRONOMÍA INDUSTRIAL","PROFESIONAL TÉCNICO"]
["SPT0120076","GASTRONOMÍA","PROFESIONAL TÉCNICO"]
["SPT0121132","GASTRONOMÍA Y ARTE CULINARIO","PROFESIONAL TÉCNICO"]
["SPT9999008","GEODESIA Y TOPOGRAFIA","PROFESIONAL TÉCNICO"]
["SPT5321266","GEOLOGÍA DE MINAS","PROFESIONAL TÉCNICO"]
["SPT7321285","GEOMÁTICA","PROFESIONAL TÉCNICO"]
["SPT4181116","GERENCIA","PROFESIONAL TÉCNICO"]
["SPT4136184","GESTIÓN ADMINISTRATIVA CON MENCIÓN EN ADMINISTRACIÓN DE NEGOCIOS AGROPECUARIOS","PROFESIONAL TÉCNICO"]
["SPT4136082","GESTIÓN ADMINISTRATIVA CON MENCIÓN EN SERVICIO NAVAL","PROFESIONAL TÉCNICO"]
["SPT4136177","GESTIÓN ADMINISTRATIVA","PROFESIONAL TÉCNICO"]
["SPT5210047","GESTIÓN AMBIENTAL","PROFESIONAL TÉCNICO"]
["SPT5210123","GESTIÓN AMBIENTAL Y DESARROLLO SOSTENIBLE","PROFESIONAL TÉCNICO"]
["SPT5210132","GESTIÓN AMBIENTAL Y RESPONSABILIDAD SOCIAL","PROFESIONAL TÉCNICO"]
["SPT4136575","GESTIÓN COMERCIAL CON MENCIÓN EN ESPACIOS DE PUNTO DE VENTA","PROFESIONAL TÉCNICO"]
["SPT4120085","GESTIÓN COMERCIAL DE PRODUCTOS Y SERVICIOS BANCARIOS Y FINANCIEROS","PROFESIONAL TÉCNICO"]
["SPT4131117","GESTIÓN COMERCIAL","PROFESIONAL TÉCNICO"]
["SPT24X0456","GESTIÓN DE CENTROS DE CONTROL","PROFESIONAL TÉCNICO"]
["SPT9170223","GESTIÓN DE FARMACIAS","PROFESIONAL TÉCNICO"]
["SPT7210025","GESTIÓN DE INDUSTRIAS ALIMENTARIAS","PROFESIONAL TÉCNICO"]
["SPT7320074","GESTIÓN DE LA CONSTRUCCIÓN CIVIL","PROFESIONAL TÉCNICO"]
["SPT7320146","GESTIÓN DE LA CONSTRUCCIÓN","PROFESIONAL TÉCNICO"]
["SPT7230192","GESTIÓN DE LA EMPRESA DE MODA Y PRODUCCIONES","PROFESIONAL TÉCNICO"]
["SPT7230145","GESTIÓN DE LA INDUSTRIA TEXTIL","PROFESIONAL TÉCNICO"]
["SPT7236068","GESTIÓN DE LA MODA Y CONFECCIONES","PROFESIONAL TÉCNICO"]
["SPT7236094","GESTIÓN DE LA PRODUCCIÓN DE PRENDAS DE VESTIR","PROFESIONAL TÉCNICO"]
["SPT7321286","GESTIÓN DE LA PRODUCCIÓN EN LA INDUSTRIA DE LA CONSTRUCCIÓN","PROFESIONAL TÉCNICO"]
["SPT7231276","GESTIÓN DE LA PRODUCCIÓN EN LA INDUSTRIA DE LAS CONFECCIONES","PROFESIONAL TÉCNICO"]
["SPT4136596","GESTIÓN DE LOGÍSTICA CON MENCIÓN EN COMERCIO INTERNACIONAL","PROFESIONAL TÉCNICO"]
["SPT4136595","GESTIÓN DE LOGÍSTICA CON MENCIÓN EN LA CADENA DE ABASTECIMIENTO","PROFESIONAL TÉCNICO"]
["SPT4136038","GESTIÓN DE LOGÍSTICA","PROFESIONAL TÉCNICO"]
["SPT4140052","GESTIÓN DE MARKETING Y VENTAS","PROFESIONAL TÉCNICO"]
["SPT7231275","GESTIÓN DE MODAS Y CONFECCIONES","PROFESIONAL TÉCNICO"]
["SPT24X0457","GESTIÓN DE PLATAFORMAS Y ESPACIOS DE ARTES VISUALES","PROFESIONAL TÉCNICO"]
["SPT4136576","GESTIÓN DE PRODUCCIÓN DE PRENDAS DE VESTIR","PROFESIONAL TÉCNICO"]
["SPT4136594","GESTIÓN DE PRODUCCIÓN INDUSTRIAL","PROFESIONAL TÉCNICO"]
["SPT4133977","GESTIÓN DE PROYECTOS","PROFESIONAL TÉCNICO"]
["SPT8111306","GESTIÓN DE RECURSOS HÍDRICOS","PROFESIONAL TÉCNICO"]
["SPT4180128","GESTIÓN DE RECURSOS HUMANOS","PROFESIONAL TÉCNICO"]
["SPT9999009","GESTION DE REDES DE AGUA POTABLE Y AGUA RESIDUAL","PROFESIONAL TÉCNICO"]
["SPT9196577","GESTIÓN DE SALUD Y SEGURIDAD EN EL TRABAJO","PROFESIONAL TÉCNICO"]
["SPT24X0408","GESTIÓN DE SEGURIDAD Y SALUD EN EL TRABAJO","PROFESIONAL TÉCNICO"]
["SPT6120205","GESTIÓN DE SISTEMAS DE INFORMACIÓN","PROFESIONAL TÉCNICO"]
["SPT6130149","GESTIÓN DE TELECOMUNICACIONES Y TRÁNSITO AÉREO","PROFESIONAL TÉCNICO"]
["SPT4136110","GESTIÓN DE TRANSPORTE Y DISTRIBUCIÓN","PROFESIONAL TÉCNICO"]
["SPT4181118","GESTIÓN DEL EMPRENDIMIENTO","PROFESIONAL TÉCNICO"]
["SPT0131726","GESTIÓN DEPORTIVA","PROFESIONAL TÉCNICO"]
["SPT24X0463","GESTION DEPORTIVA","PROFESIONAL TÉCNICO"]
["SPT4130295","GESTIÓN LOGÍSTICA","PROFESIONAL TÉCNICO"]
["SPT4130124","GESTIÓN LOGÍSTICA Y TRANSPORTE","PROFESIONAL TÉCNICO"]
["SPT4170172","GESTIÓN PÚBLICA","PROFESIONAL TÉCNICO"]
["SPT24X0437","GESTIÓN PÚBLICA Y JURÍDICA","PROFESIONAL TÉCNICO"]
["SPT7231277","GESTIÓN TEXTIL","PROFESIONAL TÉCNICO"]
["SPT4131119","GESTIÓN Y ADMINISTRACIÓN DE NEGOCIOS","PROFESIONAL TÉCNICO"]
["SPT7136585","GESTIÓN Y MANTENIMIENTO DE MAQUINARIA INDUSTRIAL","PROFESIONAL TÉCNICO"]
["SPT7136540","GESTIÓN Y MANTENIMIENTO DE MAQUINARIA PESADA","PROFESIONAL TÉCNICO"]
["SPT24X0435","GOBIERNO ELECTRÓNICO","PROFESIONAL TÉCNICO"]
["SPT24X0453","GUÍA INTÉRPRETE PARA PERSONAS CON SORDOCEGUERA","PROFESIONAL TÉCNICO"]
["SPT0141340","GUÍA OFICIAL DE CAMINATA","PROFESIONAL TÉCNICO"]
["SPT0141341","GUÍA OFICIAL DE MONTAÑA","PROFESIONAL TÉCNICO"]
["SPT0141342","GUÍA OFICIAL DE TURISMO","PROFESIONAL TÉCNICO"]
["SPT5226159","HIDROGRAFÍA","PROFESIONAL TÉCNICO"]
["SPT8311180","HIDROGRAFÍA Y NAVEGACIÓN","PROFESIONAL TÉCNICO"]
["SPT8121307","HORTICULTURA","PROFESIONAL TÉCNICO"]
["SPT0121133","HOSTELERÍA","PROFESIONAL TÉCNICO"]
["SPT0120160","HOTELERÍA Y TURISMO","PROFESIONAL TÉCNICO"]
["SPT0121134","HOTELES Y RESTAURANTES","PROFESIONAL TÉCNICO"]
["SPT7231278","INDUSTRIA DEL CUERO","PROFESIONAL TÉCNICO"]
["SPT7231279","INDUSTRIA DEL VESTIDO","PROFESIONAL TÉCNICO"]
["SPT7220208","INDUSTRIAL Y SISTEMAS","PROFESIONAL TÉCNICO"]
["SPT9999010","INDUSTRIAS ALIMENTARIAS","PROFESIONAL TÉCNICO"]
["SPT7211222","INDUSTRIAS ALIMENTARIAS LÁCTEAS","PROFESIONAL TÉCNICO"]
["SPT7211221","INDUSTRIAS ALIMENTARIAS","PROFESIONAL TÉCNICO"]
["SPT7211827","INDUSTRIAS DE ALIMENTOS Y BEBIDAS","PROFESIONAL TÉCNICO"]
["SPT24X0401","INDUSTRIAS DE ALIMENTOS Y BEBIDAS","PROFESIONAL TÉCNICO"]
["SPT0311355","INFANTERÍA DE MARINA","PROFESIONAL TÉCNICO"]
["SPT0141343","INFORMACIÓN TURÍSTICA","PROFESIONAL TÉCNICO"]
["SPT6126181","INFORMÁTICA EMPRESARIAL","PROFESIONAL TÉCNICO"]
["SPT6121196","INFORMÁTICA","PROFESIONAL TÉCNICO"]
["SPT6116073","INGENIERÍA DE DESARROLLO DE JUEGOS","PROFESIONAL TÉCNICO"]
["SPT6136067","INGENIERÍA DE REDES Y COMUNICACIONES","PROFESIONAL TÉCNICO"]
["SPT6116065","INGENIERÍA DE SISTEMAS DE INFORMACIÓN","PROFESIONAL TÉCNICO"]
["SPT6116064","INGENIERÍA DE SOFTWARE","PROFESIONAL TÉCNICO"]
["SPT6131928","INGENIERÍA DE SONIDO","PROFESIONAL TÉCNICO"]
["SPT6130025","INGENIERÍA DE TELECOMUNICACIONES","PROFESIONAL TÉCNICO"]
["SPT6130183","INGENIERÍA DE TELEMÁTICA","PROFESIONAL TÉCNICO"]
["SPT7140055","INSPECCIÓN Y MANTENIMIENTO AERONÁUTICO","PROFESIONAL TÉCNICO"]
["SPT0311356","INTELIGENCIA","PROFESIONAL TÉCNICO"]
["SPT2311024","INTERPRETACIÓN DE IDIOMAS","PROFESIONAL TÉCNICO"]
["SPT2151059","INTERPRETACIÓN MUSICAL","PROFESIONAL TÉCNICO"]
["SPT2310112","INTERPRETACIÓN","PROFESIONAL TÉCNICO"]
["SPT2151056","INTERPRETE EN DANZA CLÁSICA","PROFESIONAL TÉCNICO"]
["SPT24X0452","INTÉRPRETE EN LENGUA DE SEÑAS PERUANA","PROFESIONAL TÉCNICO"]
["SPT0320139","INVESTIGACIÓN PRIVADA Y SEGURIDAD CIUDADANA","PROFESIONAL TÉCNICO"]
["SPT9131328","INYECTABLES Y PRIMEROS AUXILIOS","PROFESIONAL TÉCNICO"]
["SPT8121308","JARDINERÍA Y PAISAJISMO","PROFESIONAL TÉCNICO"]
["SPT24X0404","JURÍDICO","PROFESIONAL TÉCNICO"]
["SPT9151330","LABORATORIO CLÍNICO","PROFESIONAL TÉCNICO"]
["SPT9156091","LABORATORIO CLÍNICO Y ANATOMÍA PATOLÓGICA","PROFESIONAL TÉCNICO"]
["SPT7321287","LABORATORIO DE SUELOS, CONCRETO Y ASFALTO","PROFESIONAL TÉCNICO"]
["SPT24X0433","LABORATORIO","PROFESIONAL TÉCNICO"]
["SPT5311267","LABORATORIO QUÍMICO Y METALÚRGICO","PROFESIONAL TÉCNICO"]
["SPT2210015","LITERATURA BÍBLICA","PROFESIONAL TÉCNICO"]
["SPT24X0430","LOCUCIÓN COMUNICACIÓN RADIAL Y TELEVISIVA","PROFESIONAL TÉCNICO"]
["SPT3220186","LOCUCIÓN Y COMUNICACIÓN RADIAL Y TELEVISIVA","PROFESIONAL TÉCNICO"]
["SPT4161151","LOGÍSTICA DEL COMERCIO INTERNACIONAL","PROFESIONAL TÉCNICO"]
["SPT4130137","LOGÍSTICA INTEGRAL Y GESTIÓN COMERCIAL","PROFESIONAL TÉCNICO"]
["SPT4130082","LOGÍSTICA INTEGRAL Y GESTIÓN DE OPERACIONES","PROFESIONAL TÉCNICO"]
["SPT24X0449","LUTERÍA","PROFESIONAL TÉCNICO"]
["SPT5221298","MANEJO DE CUENCAS Y GESTIÓN AMBIENTAL","PROFESIONAL TÉCNICO"]
["SPT8216116","MANEJO FORESTAL","PROFESIONAL TÉCNICO"]
["SPT0311357","MANIOBRAS","PROFESIONAL TÉCNICO"]
["SPT7146108","MANTENIMIENTO AERONÁUTICO","PROFESIONAL TÉCNICO"]
["SPT7141243","MANTENIMIENTO DE AERONAVES","PROFESIONAL TÉCNICO"]
["SPT0310097","MANTENIMIENTO DE AERONAVES Y SUS SISTEMAS","PROFESIONAL TÉCNICO"]
["SPT7130045","MANTENIMIENTO DE EQUIPO PESADO","PROFESIONAL TÉCNICO"]
["SPT9191331","MANTENIMIENTO DE ESTABLECIMIENTOS DE SALUD","PROFESIONAL TÉCNICO"]
["SPT0310096","MANTENIMIENTO DE ESTRUCTURAS DE AERONAVES","PROFESIONAL TÉCNICO"]
["SPT7131244","MANTENIMIENTO DE ESTRUCTURAS","PROFESIONAL TÉCNICO"]
["SPT7131246","MANTENIMIENTO DE MAQUINARIA DE PLANTA","PROFESIONAL TÉCNICO"]
["SPT7132029","MANTENIMIENTO DE MAQUINARIA PESADA MINERA","PROFESIONAL TÉCNICO"]
["SPT7130095","MANTENIMIENTO DE MAQUINARIA PESADA PARA CONSTRUCCIÓN","PROFESIONAL TÉCNICO"]
["SPT7131247","MANTENIMIENTO DE MAQUINARIA PESADA","PROFESIONAL TÉCNICO"]
["SPT7131245","MANTENIMIENTO DE MAQUINARIA","PROFESIONAL TÉCNICO"]
["SPT0310094","MANTENIMIENTO DE MOTORES DE AERONAVES","PROFESIONAL TÉCNICO"]
["SPT7141248","MANTENIMIENTO DE MOTORES, HÉLICES Y UNIDAD DE POTENCIA AUXILIAR","PROFESIONAL TÉCNICO"]
["SPT8116643","MANTENIMIENTO DE PLANTAS AGROINDUSTRIALES","PROFESIONAL TÉCNICO"]
["SPT7141249","MANTENIMIENTO DE VEHÍCULOS MOTORIZADOS Y EQUIPOS CONTRA INCENDIO","PROFESIONAL TÉCNICO"]
["SPT0310095","MANTENIMIENTO ELECTRÓNICO DE AERONAVES","PROFESIONAL TÉCNICO"]
["SPT7136140","MANTENIMIENTO INDUSTRIAL","PROFESIONAL TÉCNICO"]
["SPT7130147","MANTENIMIENTO Y GESTIÓN DE EQUIPO PESADO","PROFESIONAL TÉCNICO"]
["SPT7131250","MANTENIMIENTO Y OPERACIÓN DE ARMAMENTO Y EQUIPOS AUXILIARES","PROFESIONAL TÉCNICO"]
["SPT7130157","MANTENIMIENTO Y OPERACIÓN DE MAQUINARIA PESADA","PROFESIONAL TÉCNICO"]
["SPT7130158","MANTENIMIENTO Y REPARACIÓN DE MAQUINARIA PESADA","PROFESIONAL TÉCNICO"]
["SPT7141251","MÁQUINAS NAVALES","PROFESIONAL TÉCNICO"]
["SPT4146593","MARKETING CON MENCIÓN EN COMERCIALIZACIÓN INTERNACIONAL","PROFESIONAL TÉCNICO"]
["SPT4146147","MARKETING CON MENCIÓN EN ENTORNOS DIGITALES","PROFESIONAL TÉCNICO"]
["SPT4146151","MARKETING CON MENCIÓN EN MEDIOS DIGITALES","PROFESIONAL TÉCNICO"]
["SPT4140054","MARKETING DIGITAL","PROFESIONAL TÉCNICO"]
["SPT4141139","MARKETING EMPRESARIAL","PROFESIONAL TÉCNICO"]
["SPT4142130","MARKETING ESTRATÉGICO E INNOVACIÓN","PROFESIONAL TÉCNICO"]
["SPT4141140","MARKETING INTEGRAL","PROFESIONAL TÉCNICO"]
["SPT4140165","MARKETING INTERNACIONAL","PROFESIONAL TÉCNICO"]
["SPT4141138","MARKETING","PROFESIONAL TÉCNICO"]
["SPT4141141","MARKETING VISUAL","PROFESIONAL TÉCNICO"]
["SPT3220034","MARKETING Y COMUNICACIÓN DE LA MODA","PROFESIONAL TÉCNICO"]
["SPT4140131","MARKETING Y GESTIÓN COMERCIAL","PROFESIONAL TÉCNICO"]
["SPT4146580","MARKETING Y GESTIÓN DE EQUIPOS","PROFESIONAL TÉCNICO"]
["SPT4146581","MARKETING Y GESTIÓN DE MEDIOS DIGITALES","PROFESIONAL TÉCNICO"]
["SPT4146582","MARKETING Y GESTIÓN DE MODA","PROFESIONAL TÉCNICO"]
["SPT4140207","MARKETING Y GESTIÓN DE VENTAS","PROFESIONAL TÉCNICO"]
["SPT4146133","MARKETING Y NUEVAS TECNOLOGÍAS","PROFESIONAL TÉCNICO"]
["SPT4141142","MARKETING Y PUBLICIDAD","PROFESIONAL TÉCNICO"]
["SPT4141143","MARKETING Y VENTAS","PROFESIONAL TÉCNICO"]
["SPT7130125","MATRICERÍA","PROFESIONAL TÉCNICO"]
["SPT7141252","MECÁNICA AERONÁUTICA","PROFESIONAL TÉCNICO"]
["SPT7141253","MECÁNICA AERONAVAL","PROFESIONAL TÉCNICO"]
["SPT7131254","MECÁNICA AGRÍCOLA","PROFESIONAL TÉCNICO"]
["SPT7131255","MECÁNICA AUTOMOTRIZ","PROFESIONAL TÉCNICO"]
["SPT7130070","MECÁNICA AUTOMOTRIZ Y AUTOTRÓNICA","PROFESIONAL TÉCNICO"]
["SPT7146153","MECÁNICA DE AVIACIÓN","PROFESIONAL TÉCNICO"]
["SPT7131483","MECÁNICA DE EQUIPO PESADO","PROFESIONAL TÉCNICO"]
["SPT7131256","MECÁNICA DE MANTENIMIENTO","PROFESIONAL TÉCNICO"]
["SPT7130202","MECÁNICA DE MAQUINARIA PESADA","PROFESIONAL TÉCNICO"]
["SPT7136092","MECÁNICA DE PRODUCCIÓN INDUSTRIAL","PROFESIONAL TÉCNICO"]
["SPT7131257","MECÁNICA DE PRODUCCIÓN","PROFESIONAL TÉCNICO"]
["SPT7131258","MECÁNICA HIDRÁULICA","PROFESIONAL TÉCNICO"]
["SPT7132231","MECÁNICA INDUSTRIAL","PROFESIONAL TÉCNICO"]
["SPT24X0424","MECÁNICA INDUSTRIAL","PROFESIONAL TÉCNICO"]
["SPT7136152","MECÁNICA NAVAL","PROFESIONAL TÉCNICO"]
["SPT7130190","MECÁNICA","PROFESIONAL TÉCNICO"]
["SPT7130201","MECÁNICA Y ELECTRÓNICA DE EQUIPOS PESADOS","PROFESIONAL TÉCNICO"]
["SPT7136112","MECÁNICA Y ELECTRÓNICA DE VEHÍCULOS PESADOS","PROFESIONAL TÉCNICO"]
["SPT7130145","MECÁNICO AUTOMOTRIZ","PROFESIONAL TÉCNICO"]
["SPT7130195","MECÁNICO DE AUTOMOTORES DIESEL","PROFESIONAL TÉCNICO"]
["SPT7136644","MECÁNICO DE BUSES Y CAMIONES","PROFESIONAL TÉCNICO"]
["SPT7130215","MECÁNICO DE CONSTRUCCIONES METÁLICAS","PROFESIONAL TÉCNICO"]
["SPT7130225","MECÁNICO DE MANTENIMIENTO DE MAQUINARIA PESADA","PROFESIONAL TÉCNICO"]
["SPT7130155","MECÁNICO DE MANTENIMIENTO","PROFESIONAL TÉCNICO"]
["SPT7130235","MECÁNICO DE MAQUINARIA AGRÍCOLA","PROFESIONAL TÉCNICO"]
["SPT7130245","MECÁNICO DE MAQUINARIA PESADA","PROFESIONAL TÉCNICO"]
["SPT7130255","MECÁNICO DE MÁQUINAS HERRAMIENTAS","PROFESIONAL TÉCNICO"]
["SPT7130265","MECÁNICO ELECTRICISTA DE MANTENIMIENTO","PROFESIONAL TÉCNICO"]
["SPT7130053","MECATRÓNICA AUTOMOTRIZ","PROFESIONAL TÉCNICO"]
["SPT7130285","MECATRÓNICA DE BUSES Y CAMIONES","PROFESIONAL TÉCNICO"]
["SPT7130295","MECATRÓNICA DIGITAL","PROFESIONAL TÉCNICO"]
["SPT7130212","MECATRÓNICA INDUSTRIAL","PROFESIONAL TÉCNICO"]
["SPT7136069","MECATRÓNICA","PROFESIONAL TÉCNICO"]
["SPT7130315","MECATRÓNICO TEXTIL","PROFESIONAL TÉCNICO"]
["SPT5211299","MEDIO AMBIENTE","PROFESIONAL TÉCNICO"]
["SPT5211300","MEDIO AMBIENTE Y RECURSOS NATURALES","PROFESIONAL TÉCNICO"]
["SPT2136173","MEDIOS DIGITALES Y PUBLICIDAD","PROFESIONAL TÉCNICO"]
["SPT4141144","MERCADOTECNIA","PROFESIONAL TÉCNICO"]
["SPT7130117","METALMECÁNICA","PROFESIONAL TÉCNICO"]
["SPT7131268","METALURGIA","PROFESIONAL TÉCNICO"]
["SPT5211181","METEOROLOGÍA","PROFESIONAL TÉCNICO"]
["SPT6121197","MICROCOMPUTACIÓN E INFORMÁTICA","PROFESIONAL TÉCNICO"]
["SPT7240119","MINERÍA","PROFESIONAL TÉCNICO"]
["SPT7131269","MODELERÍA Y FUNDICIÓN","PROFESIONAL TÉCNICO"]
["SPT4181163","MONEDA EXTRANJERA","PROFESIONAL TÉCNICO"]
["SPT7146155","MOTORES DE AVIACIÓN","PROFESIONAL TÉCNICO"]
["SPT0310101","MOTORES NAVALES","PROFESIONAL TÉCNICO"]
["SPT7131259","MOTORES","PROFESIONAL TÉCNICO"]
["SPT2151060","MÚSICA","PROFESIONAL TÉCNICO"]
["SPT2151061","MÚSICA Y TECNOLOGÍA DE SONIDO","PROFESIONAL TÉCNICO"]
["SPT2151062","MUSICOLOGÍA","PROFESIONAL TÉCNICO"]
["SPT4160035","NEGOCIOS INTERNACIONALES","PROFESIONAL TÉCNICO"]
["SPT24X0427","NEGOCIOS TURÍSTICOS E INTERNACIONALES","PROFESIONAL TÉCNICO"]
["SPT9181322","NUTRICIÓN Y DIETÉTICA","PROFESIONAL TÉCNICO"]
["SPT9181323","NUTRICIÓN Y TECNOLOGÍA DE LOS ALIMENTOS","PROFESIONAL TÉCNICO"]
["SPT9141337","OBSTETRICIA","PROFESIONAL TÉCNICO"]
["SPT8111224","OLIVICULTURA Y ELAIOTECNIA","PROFESIONAL TÉCNICO"]
["SPT7131260","OPERACIÓN DE MÁQUINAS, HERRAMIENTAS Y CONTROL NUMÉRICO","PROFESIONAL TÉCNICO"]
["SPT7240058","OPERACIÓN DE PLANTAS DE PROCESAMIENTO DE MINERALES","PROFESIONAL TÉCNICO"]
["SPT7246583","OPERACIÓN DE PLANTAS Y PROCESAMIENTO DE MINERALES","PROFESIONAL TÉCNICO"]
["SPT4111177","OPERACIONES BANCARIAS Y FINANCIERAS","PROFESIONAL TÉCNICO"]
["SPT3211085","OPERACIONES DE COMUNICACIONES","PROFESIONAL TÉCNICO"]
["SPT0141344","OPERACIONES DE VIAJES","PROFESIONAL TÉCNICO"]
["SPT0311358","OPERACIONES ESPECIALES","PROFESIONAL TÉCNICO"]
["SPT0141345","OPERACIONES HOTELERAS","PROFESIONAL TÉCNICO"]
["SPT7240126","OPERACIONES MINERAS","PROFESIONAL TÉCNICO"]
["SPT7136074","OPERACIONES QUÍMICAS Y METALÚRGICAS","PROFESIONAL TÉCNICO"]
["SPT3222332","OPERADOR DE SISTEMAS DE COMUNICACIÓN","PROFESIONAL TÉCNICO"]
["SPT9191332","ÓPTICA","PROFESIONAL TÉCNICO"]
["SPT9151333","OPTOMETRÍA","PROFESIONAL TÉCNICO"]
["SPT4181120","ORGANIZACIÓN Y ADMINISTRACIÓN DE EMPRESAS","PROFESIONAL TÉCNICO"]
["SPT9161334","ORTOPEDIA","PROFESIONAL TÉCNICO"]
["SPT1991023","OTRAS CARRERAS DE EDUCACIÓN","PROFESIONAL TÉCNICO"]
["SPT4170996","OTROS PROGRAMAS EN ADMINISTRACIÓN PÚBLICA","PROFESIONAL TÉCNICO"]
["SPT4190996","OTROS PROGRAMAS EN ADMINISTRACIÓN Y COMERCIO","PROFESIONAL TÉCNICO"]
["SPT3150996","OTROS PROGRAMAS EN ANTROPOLOGÍA","PROFESIONAL TÉCNICO"]
["SPT7310996","OTROS PROGRAMAS EN ARQUITECTURA Y URBANISMO","PROFESIONAL TÉCNICO"]
["SPT2130996","OTROS PROGRAMAS EN ARTE","PROFESIONAL TÉCNICO"]
["SPT2140996","OTROS PROGRAMAS EN ARTESANÍA Y MANUALIDADES","PROFESIONAL TÉCNICO"]
["SPT9210996","OTROS PROGRAMAS EN ASISTENCIA A ADULTOS MAYORES Y DISCAPACITADOS","PROFESIONAL TÉCNICO"]
["SPT9220996","OTROS PROGRAMAS EN ASISTENCIA A LA INFANCIA Y SERVICIOS PARA JÓVENES","PROFESIONAL TÉCNICO"]
["SPT3230996","OTROS PROGRAMAS EN BIBLIOTECOLOGÍA Y ARCHIVO","PROFESIONAL TÉCNICO"]
["SPT5110996","OTROS PROGRAMAS EN BIOLOGÍA","PROFESIONAL TÉCNICO"]
["SPT6110996","OTROS PROGRAMAS EN CIENCIAS DE LA COMPUTACIÓN","PROFESIONAL TÉCNICO"]
["SPT3220996","OTROS PROGRAMAS EN CIENCIAS DE LA COMUNICACIÓN","PROFESIONAL TÉCNICO"]
["SPT5320996","OTROS PROGRAMAS EN CIENCIAS DE LA TIERRA","PROFESIONAL TÉCNICO"]
["SPT3120996","OTROS PROGRAMAS EN CIENCIAS POLÍTICAS","PROFESIONAL TÉCNICO"]
["SPT4180996","OTROS PROGRAMAS EN COMPETENCIAS LABORALES","PROFESIONAL TÉCNICO"]
["SPT7320996","OTROS PROGRAMAS EN CONSTRUCCIÓN E INGENIERÍA CIVIL","PROFESIONAL TÉCNICO"]
["SPT4110996","OTROS PROGRAMAS EN CONTABILIDAD E IMPUESTOS","PROFESIONAL TÉCNICO"]
["SPT0130996","OTROS PROGRAMAS EN DEPORTE","PROFESIONAL TÉCNICO"]
["SPT4220996","OTROS PROGRAMAS EN DERECHO PRIVADO","PROFESIONAL TÉCNICO"]
["SPT4210996","OTROS PROGRAMAS EN DERECHO PÚBLICO","PROFESIONAL TÉCNICO"]
["SPT2120996","OTROS PROGRAMAS EN DISEÑO INDUSTRIAL, DE MODAS E INTERIORES","PROFESIONAL TÉCNICO"]
["SPT5210996","OTROS PROGRAMAS EN ECOLOGÍA Y MEDIO AMBIENTE","PROFESIONAL TÉCNICO"]
["SPT3110996","OTROS PROGRAMAS EN ECONOMÍA","PROFESIONAL TÉCNICO"]
["SPT1610996","OTROS PROGRAMAS EN EDUCACIÓN ARTÍSTICA","PROFESIONAL TÉCNICO"]
["SPT1410996","OTROS PROGRAMAS EN EDUCACIÓN ESPECIAL","PROFESIONAL TÉCNICO"]
["SPT1510996","OTROS PROGRAMAS EN EDUCACIÓN FÍSICA","PROFESIONAL TÉCNICO"]
["SPT1110996","OTROS PROGRAMAS EN EDUCACIÓN INICIAL","PROFESIONAL TÉCNICO"]
["SPT0310996","OTROS PROGRAMAS EN EDUCACIÓN MILITAR Y DE DEFENSA","PROFESIONAL TÉCNICO"]
["SPT1120996","OTROS PROGRAMAS EN EDUCACIÓN PRIMARIA","PROFESIONAL TÉCNICO"]
["SPT1990996","OTROS PROGRAMAS EN EDUCACIÓN","PROFESIONAL TÉCNICO"]
["SPT1210996","OTROS PROGRAMAS EN EDUCACIÓN SECUNDARIA","PROFESIONAL TÉCNICO"]
["SPT1310996","OTROS PROGRAMAS EN EDUCACIÓN SUPERIOR Y TECNOLÓGICA","PROFESIONAL TÉCNICO"]
["SPT7110996","OTROS PROGRAMAS EN ELECTRICIDAD Y ENERGÍA","PROFESIONAL TÉCNICO"]
["SPT7120996","OTROS PROGRAMAS EN ELECTRÓNICA Y AUTOMATIZACIÓN","PROFESIONAL TÉCNICO"]
["SPT9130996","OTROS PROGRAMAS EN ENFERMERÍA","PROFESIONAL TÉCNICO"]
["SPT5420996","OTROS PROGRAMAS EN ESTADÍSTICA","PROFESIONAL TÉCNICO"]
["SPT9170996","OTROS PROGRAMAS EN FARMACIA","PROFESIONAL TÉCNICO"]
["SPT2230996","OTROS PROGRAMAS EN FILOSOFÍA Y ETICA","PROFESIONAL TÉCNICO"]
["SPT5330996","OTROS PROGRAMAS EN FÍSICA","PROFESIONAL TÉCNICO"]
["SPT4120996","OTROS PROGRAMAS EN GESTIÓN FINANCIERA, ADMINISTRACIÓN BANCARIA Y SEGUROS","PROFESIONAL TÉCNICO"]
["SPT4130996","OTROS PROGRAMAS EN GESTIÓN Y ADMINISTRACIÓN","PROFESIONAL TÉCNICO"]
["SPT1910996","OTROS PROGRAMAS EN GESTIÓN Y CALIDAD EDUCATIVA","PROFESIONAL TÉCNICO"]
["SPT2220996","OTROS PROGRAMAS EN HISTORIA Y ARQUEOLOGÍA","PROFESIONAL TÉCNICO"]
["SPT8120996","OTROS PROGRAMAS EN HORTICULTURA","PROFESIONAL TÉCNICO"]
["SPT0120996","OTROS PROGRAMAS EN HOTELERÍA, RESTAURANTES Y GASTRONOMÍA","PROFESIONAL TÉCNICO"]
["SPT2310996","OTROS PROGRAMAS EN IDIOMAS","PROFESIONAL TÉCNICO"]
["SPT7220996","OTROS PROGRAMAS EN INDUSTRIA Y PRODUCTOS TRANSFORMADOS\n(EXCEPTO ALIMENTOS, TEXTIL, AGRO, MINAS Y PETRÓLEO)","PROFESIONAL TÉCNICO"]
["SPT7210996","OTROS PROGRAMAS EN INDUSTRIAS ALIMENTARIAS","PROFESIONAL TÉCNICO"]
["SPT7330996","OTROS PROGRAMAS EN INGENIERÍA SANITARIA","PROFESIONAL TÉCNICO"]
["SPT5430996","OTROS PROGRAMAS EN INVESTIGACIÓN OPERATIVA","PROFESIONAL TÉCNICO"]
["SPT2320996","OTROS PROGRAMAS EN LINGÜÍSTICA Y LITERATURA","PROFESIONAL TÉCNICO"]
["SPT4140996","OTROS PROGRAMAS EN MARKETING Y PUBLICIDAD","PROFESIONAL TÉCNICO"]
["SPT5410996","OTROS PROGRAMAS EN MATEMÁTICA","PROFESIONAL TÉCNICO"]
["SPT7130996","OTROS PROGRAMAS EN MECÁNICA Y METALÚRGICA","PROFESIONAL TÉCNICO"]
["SPT9120996","OTROS PROGRAMAS EN MEDICINA","PROFESIONAL TÉCNICO"]
["SPT7240996","OTROS PROGRAMAS EN MINERÍA Y EXTRACCIÓN","PROFESIONAL TÉCNICO"]
["SPT2150996","OTROS PROGRAMAS EN MÚSICA Y ARTES ESCÉNICAS","PROFESIONAL TÉCNICO"]
["SPT4160996","OTROS PROGRAMAS EN NEGOCIOS INTERNACIONALES","PROFESIONAL TÉCNICO"]
["SPT9180996","OTROS PROGRAMAS EN NUTRICIÓN","PROFESIONAL TÉCNICO"]
["SPT9140996","OTROS PROGRAMAS EN OBSTETRICIA","PROFESIONAL TÉCNICO"]
["SPT9110996","OTROS PROGRAMAS EN ODONTOLOGÍA","PROFESIONAL TÉCNICO"]
["SPT0110996","OTROS PROGRAMAS EN PELUQUERÍA Y TRATAMIENTOS DE BELLEZA","PROFESIONAL TÉCNICO"]
["SPT3210996","OTROS PROGRAMAS EN PERIODISMO Y LOCUCIÓN","PROFESIONAL TÉCNICO"]
["SPT8310996","OTROS PROGRAMAS EN PESCA","PROFESIONAL TÉCNICO"]
["SPT8110996","OTROS PROGRAMAS EN PRODUCCIÓN AGRÍCOLA Y GANADERA","PROFESIONAL TÉCNICO"]
["SPT7230996","OTROS PROGRAMAS EN PRODUCCIÓN TEXTIL Y CONFECCIONES","PROFESIONAL TÉCNICO"]
["SPT0320995","OTROS PROGRAMAS EN PROTECCIÓN DE LAS PERSONAS Y DE LA PROPIEDAD","PROFESIONAL TÉCNICO"]
["SPT3130996","OTROS PROGRAMAS EN PSICOLOGÍA","PROFESIONAL TÉCNICO"]
["SPT5310996","OTROS PROGRAMAS EN QUÍMICA","PROFESIONAL TÉCNICO"]
["SPT5220996","OTROS PROGRAMAS EN RECURSOS HÍDRICOS","PROFESIONAL TÉCNICO"]
["SPT2210996","OTROS PROGRAMAS EN RELIGIÓN Y TEOLOGÍA","PROFESIONAL TÉCNICO"]
["SPT9190996","OTROS PROGRAMAS EN SALUD","PROFESIONAL TÉCNICO"]
["SPT0220996","OTROS PROGRAMAS EN SALUD Y PROTECCIÓN LABORAL","PROFESIONAL TÉCNICO"]
["SPT0210996","OTROS PROGRAMAS EN SANEAMIENTO DE LA COMUNIDAD","PROFESIONAL TÉCNICO"]
["SPT4150996","OTROS PROGRAMAS EN SECRETARIADO Y TRABAJO DE OFICINA","PROFESIONAL TÉCNICO"]
["SPT0410996","OTROS PROGRAMAS EN SERVICIOS DE TRANSPORTE","PROFESIONAL TÉCNICO"]
["SPT8210996","OTROS PROGRAMAS EN SILVICULTURA","PROFESIONAL TÉCNICO"]
["SPT6120996","OTROS PROGRAMAS EN SISTEMAS Y CÓMPUTO","PROFESIONAL TÉCNICO"]
["SPT3140996","OTROS PROGRAMAS EN SOCIOLOGÍA Y ESTUDIOS CULTURALES","PROFESIONAL TÉCNICO"]
["SPT2110996","OTROS PROGRAMAS EN TÉCNICAS AUDIOVISUALES Y DE PRODUCCIÓN PARA MEDIOS DE COMUNICACIÓN","PROFESIONAL TÉCNICO"]
["SPT9150996","OTROS PROGRAMAS EN TECNOLOGÍA DE DIAGNÓSTICO Y TRATAMIENTO MÉDICO","PROFESIONAL TÉCNICO"]
["SPT6130996","OTROS PROGRAMAS EN TELECOMUNICACIONES","PROFESIONAL TÉCNICO"]
["SPT9160996","OTROS PROGRAMAS EN TERAPIA Y REHABILITACIÓN","PROFESIONAL TÉCNICO"]
["SPT9230996","OTROS PROGRAMAS EN TRABAJO SOCIAL","PROFESIONAL TÉCNICO"]
["SPT7140996","OTROS PROGRAMAS EN VEHÍCULOS, BARCOS Y AERONAVES MOTORIZADAS","PROFESIONAL TÉCNICO"]
["SPT8410996","OTROS PROGRAMAS EN VETERINARIA","PROFESIONAL TÉCNICO"]
["SPT0140996","OTROS PROGRAMAS EN VIAJES, TURISMO Y ACTIVIDADES RECREATIVAS","PROFESIONAL TÉCNICO"]
["SPT9121321","PARAMÉDICO","PROFESIONAL TÉCNICO"]
["SPT0121135","PASTELERÍA","PROFESIONAL TÉCNICO"]
["SPT1611021","PEDAGOGÍA DE LA INTERPRETACIÓN MUSICAL","PROFESIONAL TÉCNICO"]
["SPT3211087","PERIODISMO AUDIOVISUAL","PROFESIONAL TÉCNICO"]
["SPT3211088","PERIODISMO DEPORTIVO","PROFESIONAL TÉCNICO"]
["SPT3211086","PERIODISMO","PROFESIONAL TÉCNICO"]
["SPT3211089","PERIODISMO RADIAL Y TELEVISIVO","PROFESIONAL TÉCNICO"]
["SPT3210198","PERIODISMO Y MEDIOS DIGITALES","PROFESIONAL TÉCNICO"]
["SPT3216599","PERIODISMO Y NUEVOS MEDIOS","PROFESIONAL TÉCNICO"]
["SPT8310061","PESCA Y NAVEGACIÓN","PROFESIONAL TÉCNICO"]
["SPT24X0444","PESCA Y PROCESAMIENTO PESQUERO","PROFESIONAL TÉCNICO"]
["SPT4181164","PLANIFICACIÓN EMPRESARIAL","PROFESIONAL TÉCNICO"]
["SPT4181165","PLANIFICACIÓN Y GESTIÓN DE DESARROLLO","PROFESIONAL TÉCNICO"]
["SPT0311359","POLICÍA NAVAL","PROFESIONAL TÉCNICO"]
["SPT24X0413","POST PRODUCCIÓN Y ANIMACIÓN","PROFESIONAL TÉCNICO"]
["SPT0310102","PRACTICAJE FLUVIAL","PROFESIONAL TÉCNICO"]
["SPT1510224","PREPARACIÓN FISICA DE ALTO RENDIMIENTO","PROFESIONAL TÉCNICO"]
["SPT0226111","PREVENCIÓN, SEGURIDAD Y SALUD EN EL TRABAJO","PROFESIONAL TÉCNICO"]
["SPT7210055","PROCESADOR INDUSTRIAL DE ALIMENTOS","PROFESIONAL TÉCNICO"]
["SPT7210065","PROCESADOR INDUSTRIAL DE ALIMENTOS Y BEBIDAS","PROFESIONAL TÉCNICO"]
["SPT6121198","PROCESAMIENTO DE DATOS","PROFESIONAL TÉCNICO"]
["SPT24X0461","PROCESOS DE CONSERVACIÓN Y RESTAURACIÓN DE BIENES CULTURALES MATERIALES","PROFESIONAL TÉCNICO"]
["SPT7212433","PROCESOS DE LA INDUSTRIA ALIMENTARIA Y PRODUCTOS HIDROBIOLÓGICOS","PROFESIONAL TÉCNICO"]
["SPT7220025","PROCESOS DE PRODUCCIÓN INDUSTRIAL","PROFESIONAL TÉCNICO"]
["SPT7230095","PROCESOS DE PRODUCCIÓN TEXTIL","PROFESIONAL TÉCNICO"]
["SPT24X0455","PROCESOS EN SEGURIDAD, SALUD EN EL TRABAJO Y MEDIO AMBIENTE","PROFESIONAL TÉCNICO"]
["SPT7221217","PROCESOS INDUSTRIALES Y DE SISTEMAS","PROFESIONAL TÉCNICO"]
["SPT7130168","PROCESOS QUÍMICOS METALÚRGICOS","PROFESIONAL TÉCNICO"]
["SPT5310035","PROCESOS QUÍMICOS","PROFESIONAL TÉCNICO"]
["SPT7131270","PROCESOS QUÍMICOS Y METALÚRGICOS","PROFESIONAL TÉCNICO"]
["SPT8111309","PRODUCCIÓN AGRARIA","PROFESIONAL TÉCNICO"]
["SPT8111310","PRODUCCIÓN AGRÍCOLA","PROFESIONAL TÉCNICO"]
["SPT8111311","PRODUCCIÓN AGROPECUARIA","PROFESIONAL TÉCNICO"]
["SPT24X0458","PRODUCCIÓN DE ARTES VISUALES","PROFESIONAL TÉCNICO"]
["SPT7230025","PRODUCCIÓN DE CONFECCIONES","PROFESIONAL TÉCNICO"]
["SPT24X0448","PRODUCCIÓN DE CUERO","PROFESIONAL TÉCNICO"]
["SPT3221081","PRODUCCIÓN DE ESPECTÁCULOS","PROFESIONAL TÉCNICO"]
["SPT2111053","PRODUCCIÓN DE IMPRESOS","PROFESIONAL TÉCNICO"]
["SPT3221082","PRODUCCIÓN DE PROGRAMAS DE TELEVISIÓN","PROFESIONAL TÉCNICO"]
["SPT3221083","PRODUCCIÓN DE RADIO Y TELEVISIÓN","PROFESIONAL TÉCNICO"]
["SPT8311296","PRODUCCIÓN EN PESQUERÍA","PROFESIONAL TÉCNICO"]
["SPT24X0454","PRODUCCIÓN FOTOGRÁFICA","PROFESIONAL TÉCNICO"]
["SPT2110375","PRODUCCIÓN GRÁFICA","PROFESIONAL TÉCNICO"]
["SPT24X0450","PRODUCCIÓN INDUSTRIAL","PROFESIONAL TÉCNICO"]
["SPT2151063","PRODUCCIÓN MUSICAL","PROFESIONAL TÉCNICO"]
["SPT8111312","PRODUCCIÓN PECUARIA","PROFESIONAL TÉCNICO"]
["SPT7231280","PRODUCCIÓN TEXTIL","PROFESIONAL TÉCNICO"]
["SPT7210140","PRODUCCIÓN Y GESTIÓN INDUSTRIAL","PROFESIONAL TÉCNICO"]
["SPT8111313","PRODUCCIÓN Y GESTIÓN PECUARIA","PROFESIONAL TÉCNICO"]
["SPT24X0414","PRODUCCIÓN Y REALIZACIÓN AUDIOVISUAL","PROFESIONAL TÉCNICO"]
["SPT3226119","PRODUCCIÓN Y REALIZACIÓN DE TELEVISIÓN, RADIO Y MEDIOS DIGITALES","PROFESIONAL TÉCNICO"]
["SPT6121199","PROGRAMACIÓN","PROFESIONAL TÉCNICO"]
["SPT0211067","PROMOCIÓN COMUNAL","PROFESIONAL TÉCNICO"]
["SPT24X0462","PROMOCIÓN DE BIENES CULTURALES MATERIALES","PROFESIONAL TÉCNICO"]
["SPT0141346","PROMOCIÓN DE TURISMO 1/ INCLUYE LA CARRERA DE PROMOCIÓN TURÍSTICA","PROFESIONAL TÉCNICO"]
["SPT0140155","PROMOCIÓN DE TURISMO","PROFESIONAL TÉCNICO"]
["SPT0140165","PROMOCIÓN TURÍSTICA","PROFESIONAL TÉCNICO"]
["SPT9111324","PRÓTESIS DENTAL","PROFESIONAL TÉCNICO"]
["SPT4141054","PUBLICIDAD","PROFESIONAL TÉCNICO"]
["SPT4146114","PUBLICIDAD Y BRANDING","PROFESIONAL TÉCNICO"]
["SPT4142534","PUBLICIDAD Y MARKETING DIGITAL","PROFESIONAL TÉCNICO"]
["SPT4140227","PUBLICIDAD Y MEDIOS DIGITALES","PROFESIONAL TÉCNICO"]
["SPT5311183","QUÍMICA INDUSTRIAL","PROFESIONAL TÉCNICO"]
["SPT5310055","QUÍMICA TEXTIL","PROFESIONAL TÉCNICO"]
["SPT9151335","RADIOLOGÍA","PROFESIONAL TÉCNICO"]
["SPT8110065","RECURSOS HÍDRICOS","PROFESIONAL TÉCNICO"]
["SPT6120255","REDES DE COMPUTADORAS Y COMUNICACIÓN DE DATOS","PROFESIONAL TÉCNICO"]
["SPT6121200","REDES Y COMUNICACIÓN DE DATOS","PROFESIONAL TÉCNICO"]
["SPT6110176","REDES Y COMUNICACIONES DE DATOS","PROFESIONAL TÉCNICO"]
["SPT6121201","REDES Y COMUNICACIONES","PROFESIONAL TÉCNICO"]
["SPT6121202","REDES Y SEGURIDAD INFORMÁTICA","PROFESIONAL TÉCNICO"]
["SPT4141068","RELACIONES INSTITUCIONALES","PROFESIONAL TÉCNICO"]
["SPT3141069","RELACIONES PÚBLICAS","PROFESIONAL TÉCNICO"]
["SPT24X0423","RELACIONES PÚBLICAS Y MARKETING","PROFESIONAL TÉCNICO"]
["SPT2211028","RELIGIÓN Y EDUCACIÓN PARA EL TRABAJO","PROFESIONAL TÉCNICO"]
["SPT6121203","REPARACIÓN DE COMPUTADORAS","PROFESIONAL TÉCNICO"]
["SPT6121204","REPARACIÓN DE COMPUTADORAS Y REDES","PROFESIONAL TÉCNICO"]
["SPT3211090","REPORTERISMO","PROFESIONAL TÉCNICO"]
["SPT7311294","RESTAURACIÓN DE MONUMENTOS HISTÓRICOS Y BIENES INMUEBLES","PROFESIONAL TÉCNICO"]
["SPT2131034","RESTAURACIÓN Y CONSERVACIÓN DE OBRAS DE ARTE","PROFESIONAL TÉCNICO"]
["SPT8111314","RIEGO DRENAJE","PROFESIONAL TÉCNICO"]
["SPT8110066","RIEGO Y DRENAJE","PROFESIONAL TÉCNICO"]
["SPT0210025","SALUD PÚBLICA","PROFESIONAL TÉCNICO"]
["SPT0221218","SALUD Y SEGURIDAD OCUPACIONAL","PROFESIONAL TÉCNICO"]
["SPT24X0440","SECRETARIADO EJECUTIVO BILINGUE","PROFESIONAL TÉCNICO"]
["SPT4151154","SECRETARIADO EJECUTIVO BILINGÜE","PROFESIONAL TÉCNICO"]
["SPT4151155","SECRETARIADO EJECUTIVO COMPUTARIZADO","PROFESIONAL TÉCNICO"]
["SPT4151153","SECRETARIADO EJECUTIVO","PROFESIONAL TÉCNICO"]
["SPT4150063","SECRETARIADO EJECUTIVO Y GERENCIA","PROFESIONAL TÉCNICO"]
["SPT4151156","SECRETARIADO EJECUTIVO Y GERENCIAL","PROFESIONAL TÉCNICO"]
["SPT4151157","SECRETARIADO INTERNACIONAL EJECUTIVO","PROFESIONAL TÉCNICO"]
["SPT6126590","SEGURIDAD DE LA INFORMACIÓN","PROFESIONAL TÉCNICO"]
["SPT0311360","SEGURIDAD E INSTRUCCIÓN MILITAR","PROFESIONAL TÉCNICO"]
["SPT0220045","SEGURIDAD INDUSTRIAL Y PREVENCIÓN DE RIESGOS","PROFESIONAL TÉCNICO"]
["SPT6121205","SEGURIDAD INFORMÁTICA","PROFESIONAL TÉCNICO"]
["SPT0226174","SEGURIDAD INTEGRAL","PROFESIONAL TÉCNICO"]
["SPT0226086","SEGURIDAD Y PREVENCIÓN DE RIESGOS","PROFESIONAL TÉCNICO"]
["SPT7240127","SEGURIDAD Y PREVENCIÓN EN LA INDUSTRIA Y MINERÍA","PROFESIONAL TÉCNICO"]
["SPT0220075","SEGURIDAD, SALUD OCUPACIONAL Y MEDIO AMBIENTE","PROFESIONAL TÉCNICO"]
["SPT0316158","SENSORES DE AVIACIÓN","PROFESIONAL TÉCNICO"]
["SPT0311361","SENSORES","PROFESIONAL TÉCNICO"]
["SPT0316154","SEÑALES","PROFESIONAL TÉCNICO"]
["SPT24X0451","SEÑALIZACIÓN Y SEMAFORIZACIÓN","PROFESIONAL TÉCNICO"]
["SPT0121136","SERVICIOS HOTELEROS Y COCINA","PROFESIONAL TÉCNICO"]
["SPT0310103","SERVICIOS","PROFESIONAL TÉCNICO"]
["SPT6136640","SISTEMA DE TELECOMUNICACIONES","PROFESIONAL TÉCNICO"]
["SPT7121238","SISTEMAS AUTOMÁTICOS PROGRAMABLES","PROFESIONAL TÉCNICO"]
["SPT6121206","SISTEMAS DE INFORMACIÓN","PROFESIONAL TÉCNICO"]
["SPT6131211","SISTEMAS DE TELECOMUNICACIONES","PROFESIONAL TÉCNICO"]
["SPT6121207","SISTEMAS INFORMÁTICOS PARA LA PRODUCTIVIDAD","PROFESIONAL TÉCNICO"]
["SPT4130129","SISTEMAS INTEGRADOS DE GESTIÓN","PROFESIONAL TÉCNICO"]
["SPT6116081","SISTEMAS Y ADMINISTRACIÓN DE REDES CON MENCIÓN EN SERVICIO NAVAL","PROFESIONAL TÉCNICO"]
["SPT6110118","SISTEMAS Y COMPUTACIÓN","PROFESIONAL TÉCNICO"]
["SPT6121208","SOFTWARE Y SISTEMAS","PROFESIONAL TÉCNICO"]
["SPT7130375","SOLDADOR UNIVERSAL","PROFESIONAL TÉCNICO"]
["SPT7130050","SOLDADURA INDUSTRIAL","PROFESIONAL TÉCNICO"]
["SPT0316157","SONAR","PROFESIONAL TÉCNICO"]
["SPT6121209","SOPORTE DE SISTEMAS Y REDES","PROFESIONAL TÉCNICO"]
["SPT6120375","SOPORTE Y MANTENIMIENTO DE EQUIPOS DE COMPUTACIÓN","PROFESIONAL TÉCNICO"]
["SPT7321288","SUELOS, CONCRETO Y ASFALTO","PROFESIONAL TÉCNICO"]
["SPT7246139","SUPERVISIÓN DE EQUIPOS EN MINERÍA SUBTERRÁNEA","PROFESIONAL TÉCNICO"]
["SPT4181166","SUPERVISIÓN DE OPERACIONES","PROFESIONAL TÉCNICO"]
["SPT2151066","TEATRO Y TELEVISIÓN","PROFESIONAL TÉCNICO"]
["SPT24X0438","TÉCNICA DE FARMACIA","PROFESIONAL TÉCNICO"]
["SPT9170040","TÉCNICA EN FARMACIA","PROFESIONAL TÉCNICO"]
["SPT9160049","TÉCNICA EN FISIOTERAPIA Y REHABILITACIÓN","PROFESIONAL TÉCNICO"]
["SPT6131212","TÉCNICA EN INGENIERÍA DE SONIDOS","PROFESIONAL TÉCNICO"]
["SPT6131213","TÉCNICA EN INGENIERÍA DE TELECOMUNICACIONES","PROFESIONAL TÉCNICO"]
["SPT6131214","TÉCNICA EN INGENIERÍA DE TELEMÁTICA","PROFESIONAL TÉCNICO"]
["SPT7131261","TÉCNICA EN INGENIERÍA MECÁNICA DE MANTENIMIENTO","PROFESIONAL TÉCNICO"]
["SPT7131262","TÉCNICA EN INGENIERÍA MECÁNICA DE PRODUCCIÓN","PROFESIONAL TÉCNICO"]
["SPT9150043","TÉCNICA EN LABORATORIO CLÍNICO","PROFESIONAL TÉCNICO"]
["SPT4140178","TÉCNICA EN MERCADOTECNIA","PROFESIONAL TÉCNICO"]
["SPT9140144","TÉCNICA EN OBSTETRICIA","PROFESIONAL TÉCNICO"]
["SPT9152635","TÉCNICA EN OPTOMETRÍA","PROFESIONAL TÉCNICO"]
["SPT9110087","TÉCNICA EN PRÓTESIS DENTAL","PROFESIONAL TÉCNICO"]
["SPT9176101","TÉCNICAS DE FARMACIA","PROFESIONAL TÉCNICO"]
["SPT6110081","TÉCNICAS DE INGENIERÍA DE SOFTWARE","PROFESIONAL TÉCNICO"]
["SPT6136075","TÉCNICAS DE INGENIERÍA DE TELECOMUNICACIONES","PROFESIONAL TÉCNICO"]
["SPT7111229","TÉCNICAS DE INGENIERÍA ELÉCTRICA","PROFESIONAL TÉCNICO"]
["SPT7121239","TÉCNICAS DE INGENIERÍA ELECTRÓNICA","PROFESIONAL TÉCNICO"]
["SPT7130395","TÉCNICAS DE INGENIERÍA MECÁNICA DE PRODUCCIÓN","PROFESIONAL TÉCNICO"]
["SPT7240108","TÉCNICAS EN EXPLOTACIÓN MINERA","PROFESIONAL TÉCNICO"]
["SPT6136063","TÉCNICAS EN INGENIERÍA DE SONIDO","PROFESIONAL TÉCNICO"]
["SPT7120185","TÉCNICAS EN INGENIERÍA ELECTRÓNICA","PROFESIONAL TÉCNICO"]
["SPT7130405","TÉCNICAS EN INGENIERÍA MECÁNICA DE MANTENIMIENTO","PROFESIONAL TÉCNICO"]
["SPT6110228","TÉCNICO EN INGENIERÍA DE REDES Y COMUNICACIÓN","PROFESIONAL TÉCNICO"]
["SPT4160187","TÉCNICO EN MERCADOTECNIA","PROFESIONAL TÉCNICO"]
["SPT8111315","TECNOLOGÍA AGRÍCOLA","PROFESIONAL TÉCNICO"]
["SPT7212736","TECNOLOGÍA ASEGURAMIENTO DE CALIDAD DE PRODUCTOS HIDROBIOLÓGICOS","PROFESIONAL TÉCNICO"]
["SPT5311184","TECNOLOGÍA DE ANÁLISIS QUÍMICO","PROFESIONAL TÉCNICO"]
["SPT7221219","TECNOLOGÍA DE LA PRODUCCIÓN","PROFESIONAL TÉCNICO"]
["SPT7230115","TECNOLOGÍA DE PROCESOS DE PRODUCCIÓN DE PRENDAS DE VESTIR","PROFESIONAL TÉCNICO"]
["SPT7230125","TECNOLOGÍA DEL DISEÑO Y DESARROLLO DE PRENDAS DE VESTIR","PROFESIONAL TÉCNICO"]
["SPT7240125","TECNOLOGÍA EN PETRÓLEO Y REFINACIÓN","PROFESIONAL TÉCNICO"]
["SPT24X0431","TECNOLOGÍA EN PETRÓLEO, GAS Y REFINACIÓN","PROFESIONAL TÉCNICO"]
["SPT7131263","TECNOLOGÍA MECÁNICA ELÉCTRICA","PROFESIONAL TÉCNICO"]
["SPT3141070","TECNOLOGÍA PENITENCIARIA","PROFESIONAL TÉCNICO"]
["SPT8311297","TECNOLOGÍA PESQUERA","PROFESIONAL TÉCNICO"]
["SPT8316104","TECNOLOGÍA PESQUERA Y ACUÍCOLA","PROFESIONAL TÉCNICO"]
["SPT5210045","TECNOLOGÍAS AMBIENTALES","PROFESIONAL TÉCNICO"]
["SPT24X0459","TECNOLOGÍAS APLICADAS AL SONIDO","PROFESIONAL TÉCNICO"]
["SPT6120385","TECNOLOGÍAS DE LA INFORMACIÓN Y COMUNICACIÓN","PROFESIONAL TÉCNICO"]
["SPT24X0436","TECNOLOGÍAS DE LA INFORMACIÓN Y LA COMUNICACIÓN","PROFESIONAL TÉCNICO"]
["SPT6110073","TELECOMUNICACIONES E INFORMÁTICA","PROFESIONAL TÉCNICO"]
["SPT0310092","TELECOMUNICACIONES MILITARES","PROFESIONAL TÉCNICO"]
["SPT6131215","TELECOMUNICACIONES","PROFESIONAL TÉCNICO"]
["SPT6136080","TELEMÁTICA CON MENCIÓN EN SERVICIO NAVAL","PROFESIONAL TÉCNICO"]
["SPT6131216","TELEMÁTICA","PROFESIONAL TÉCNICO"]
["SPT2211029","TEOLOGÍA - CATÓLICA","PROFESIONAL TÉCNICO"]
["SPT2211031","TEOLOGÍA - FORMACIÓN RELIGIOSA","PROFESIONAL TÉCNICO"]
["SPT2211030","TEOLOGÍA EVANGÉLICA","PROFESIONAL TÉCNICO"]
["SPT2210173","TEOLOGÍA INVESTIGACIÓN SOCIO RELIGIOSA","PROFESIONAL TÉCNICO"]
["SPT2210035","TEOLOGÍA","PROFESIONAL TÉCNICO"]
["SPT9166120","TERAPIA FÍSICA","PROFESIONAL TÉCNICO"]
["SPT24X0412","TERAPIA FÍSICA Y REHABILITACIÓN","PROFESIONAL TÉCNICO"]
["SPT3131071","TERAPIA PSICOANALÍTICA","PROFESIONAL TÉCNICO"]
["SPT7321289","TOPOGRAFÍA","PROFESIONAL TÉCNICO"]
["SPT7240181","TOPOGRAFÍA SUPERFICIAL MINERA","PROFESIONAL TÉCNICO"]
["SPT7321290","TOPOGRAFÍA SUPERFICIAL Y MINERA","PROFESIONAL TÉCNICO"]
["SPT2311025","TRADUCCIÓN DE IDIOMAS","PROFESIONAL TÉCNICO"]
["SPT2316584","TRADUCCIÓN E INTERPRETACIÓN DE IDIOMAS","PROFESIONAL TÉCNICO"]
["SPT2310107","TRADUCCIÓN E INTERPRETACIÓN DE IDIOMAS(INGLÉS,FRANCÉS Y CASTELLANO)","PROFESIONAL TÉCNICO"]
["SPT2310185","TRADUCCIÓN E INTERPRETACIÓN DE INGLÉS","PROFESIONAL TÉCNICO"]
["SPT2311026","TRADUCCIÓN E INTERPRETACIÓN","PROFESIONAL TÉCNICO"]
["SPT2310111","TRADUCCIÓN","PROFESIONAL TÉCNICO"]
["SPT5220025","TRATAMIENTO DE AGUA","PROFESIONAL TÉCNICO"]
["SPT0141347","TURISMO","PROFESIONAL TÉCNICO"]
["SPT0141137","TURISMO Y HOTELERÍA","PROFESIONAL TÉCNICO"]
["SPT4141145","VENTAS","PROFESIONAL TÉCNICO"]
["SPT0141348","VIAJES Y TURISMO","PROFESIONAL TÉCNICO"]
["SPT8111225","VITICULTURA Y ENOLOGÍA","PROFESIONAL TÉCNICO"]
["SPT8111179","ZOOTECNIA","PROFESIONAL TÉCNICO"]
["SPT24X0443","ZOOTECNIA Y SANIDAD PECUARIA","PROFESIONAL TÉCNICO"]
["SPT8110114","ZOOTECNISTA","PROFESIONAL TÉCNICO"]
["SPTAG99999","OTROS PROFESIONAL TÉCNICO","PROFESIONAL TÉCNICO"]
["STE6111395","ADMINISTRACIÓN DE BASE DE DATOS","TÉCNICO"]
["STE6126167","ADMINISTRACIÓN DE DATOS","TÉCNICO"]
["STE0121375","ADMINISTRACIÓN DE HOSTELERÍA","TÉCNICO"]
["STE0121376","ADMINISTRACIÓN DE HOTELES","TÉCNICO"]
["STE7321441","ADMINISTRACIÓN DE LA CONSTRUCCIÓN","TÉCNICO"]
["STE4130068","ADMINISTRACIÓN DE PEQUEÑOS NEGOCIOS","TÉCNICO"]
["STE6121396","ADMINISTRACIÓN DE REDES","TÉCNICO"]
["STE0121377","ADMINISTRACIÓN DE RESTAURANTES","TÉCNICO"]
["STE4130077","ADMINISTRACIÓN DE SERVICIOS","TÉCNICO"]
["STE0121378","ADMINISTRACIÓN TURÍSTICA","TÉCNICO"]
["STE4136624","ALMACENAMIENTO E INVENTARIOS","TÉCNICO"]
["STE8111455","ALTO RIESGO","TÉCNICO"]
["STE5426615","ANÁLISIS DE DATOS EMPRESARIALES","TÉCNICO"]
["STE4146625","ANÁLISIS DE MERCADOS","TÉCNICO"]
["STE4126616","ASESORAMIENTO OPERATIVO Y COMERCIAL DE PRODUCTOS BANCARIOS Y FINANCIEROS","TÉCNICO"]
["STE4181379","AVIACIÓN COMERCIAL","TÉCNICO"]
["STE8111451","AVICULTURA Y CRIANZA DE ANIMALES MENORES","TÉCNICO"]
["STE0126617","BAR Y COCTELERÍA","TÉCNICO"]
["STE0326175","CIENCIAS ADMINISTRATIVAS Y POLICIALES","TÉCNICO"]
["STE0121381","COCINA","TÉCNICO"]
["STE0120121","COCINA Y RESTAURANTES","TÉCNICO"]
["STE4161388","COMERCIO INTERNACIONAL","TÉCNICO"]
["STE4181392","COMERCIO","TÉCNICO"]
["STE4131389","COMERCIO Y PRODUCCIÓN","TÉCNICO"]
["STE6116505","COMPUTACIÓN E INFORMÁTICA","TÉCNICO"]
["STE24X0404","COMPUTACIÓN","TÉCNICO"]
["STE7241424","CONCENTRACIÓN DE MINERALES POR SEPARACIÓN FÍSICA","TÉCNICO"]
["STE7211401","CONFITERÍA INDUSTRIAL","TÉCNICO"]
["STE3130029","CONSEJERÍA DE ORIENTACIÓN PSICOANALÍTICA","TÉCNICO"]
["STE8111454","CONSERVACIÓN Y APROVECHAMIENTO RACIONAL DE RECURSOS FORESTALES","TÉCNICO"]
["STE4110069","CONTABILIDAD OPERATIVA","TÉCNICO"]
["STE4111394","CONTABILIDAD","TÉCNICO"]
["STE0131363","DEPORTES","TÉCNICO"]
["STE6120152","DESARROLLO DE REDES","TÉCNICO"]
["STE6120150","DESARROLLO DE SOFTWARE","TÉCNICO"]
["STE7316089","DIBUJO DE ARQUITECTURA Y OBRAS CIVILES","TÉCNICO"]
["STE7320030","DIBUJO DE CONSTRUCCIÓN CIVIL","TÉCNICO"]
["STE3220193","DIRECCIÓN DE RADIO Y TELEVISIÓN","TÉCNICO"]
["STE0130199","DIRECCIÓN TÉCNICA EN FÚTBOL","TÉCNICO"]
["STE7111410","ELECTRICIDAD INDUSTRIAL","TÉCNICO"]
["STE7121417","ELECTROMECÁNICA","TÉCNICO"]
["STE7121413","ELECTRÓNICA DE CONSUMO","TÉCNICO"]
["STE24X0407","ELECTRÓNICA","TÉCNICO"]
["STE7241425","EXPLOTACIÓN DE MINAS","TÉCNICO"]
["STE7211403","EXTRACCIÓN DE ACEITES, GRASAS Y AZÚCAR","TÉCNICO"]
["STE7236503","FABRICACIÓN DE PRENDAS DE VESTIR","TÉCNICO"]
["STE9171456","FARMACIA","TÉCNICO"]
["STE8110031","FRUTICULTURA","TÉCNICO"]
["STE5326096","GEOLOGÍA Y EXPLORACIÓN","TÉCNICO"]
["STE4130171","GESTIÓN DE LOGÍSTICA Y DE ALMACENES","TÉCNICO"]
["STE4130179","GESTIÓN EMPRESARIAL","TÉCNICO"]
["STE4130170","GESTIÓN Y ADMINISTRACIÓN DE PEQUEÑOS NEGOCIOS","TÉCNICO"]
["STE0141457","GUÍA DE TURISTAS","TÉCNICO"]
["STE8120032","HORTICULTURA","TÉCNICO"]
["STE0121383","HOSTELERÍA","TÉCNICO"]
["STE7231435","INDUSTRIA DEL VESTIDO","TÉCNICO"]
["STE7116510","INSTALACIONES ELÉCTRICAS","TÉCNICO"]
["STE7110099","INSTRUMENTACIÓN INDUSTRIAL","TÉCNICO"]
["STE0320138","INVESTIGACIÓN PRIVADA","TÉCNICO"]
["STE8111453","JARDINERÍA Y FLORICULTURA","TÉCNICO"]
["STE24X0406","JOYERÍA","TÉCNICO"]
["STE2211365","LITERATURA BÍBLICA","TÉCNICO"]
["STE3211371","LOCUCIÓN Y COMUNICACIÓN DE RADIO Y TELEVISIÓN","TÉCNICO"]
["STE4136168","LOGÍSTICA DIGITAL INTEGRADA","TÉCNICO"]
["STE9999001","MANTENIMIENTO DE EQUIPO PESADO","TÉCNICO"]
["STE24X0402","MANTENIMIENTO DE EQUIPO PESADO","TÉCNICO"]
["STE7136618","MANTENIMIENTO DE MAQUINARIAS Y REDES ELÉCTRICAS","TÉCNICO"]
["STE7110204","MANTENIMIENTO DE MÁQUINAS Y REDES ELÉCTRICAS","TÉCNICO"]
["STE7136095","MANTENIMIENTO DE PLANTAS INDUSTRIALES","TÉCNICO"]
["STE7116619","MANTENIMIENTO DE SISTEMAS ELÉCTRICOS","TÉCNICO"]
["STE24X0401","MANTENIMIENTO DE SISTEMAS ELECTRÓNICOS","TÉCNICO"]
["STE7116097","MANTENIMIENTO ELÉCTRICO E INSTRUMENTACIÓN","TÉCNICO"]
["STE7116620","MANTENIMIENTO ELECTRÓNICO INDUSTRIAL","TÉCNICO"]
["STE7131419","MATRICERÍA","TÉCNICO"]
["STE7131420","MECÁNICA AUTOMOTRIZ","TÉCNICO"]
["STE7131421","MECÁNICA DE EQUIPOS PESADOS","TÉCNICO"]
["STE7131422","MECÁNICA DE PLANTA","TÉCNICO"]
["STE7131423","MECÁNICA DE PRODUCCIÓN","TÉCNICO"]
["STE7130210","MECÁNICA INDUSTRIAL","TÉCNICO"]
["STE24X0405","MECATRÓNICA AUTOMOTRIZ","TÉCNICO"]
["STE5216100","MEDIO AMBIENTE","TÉCNICO"]
["STE2116169","MODELADO Y ANIMACIÓN DIGITAL","TÉCNICO"]
["STE7211405","MOLINERÍA Y PROCESAMIENTO DE GRANOS Y TUBÉRCULOS","TÉCNICO"]
["STE8311450","NAVEGACIÓN Y PESCA","TÉCNICO"]
["STE4161390","NEGOCIOS - COMERCIO INTERNACIONAL","TÉCNICO"]
["STE4131391","NEGOCIOS - COMERCIO Y PRODUCCIÓN","TÉCNICO"]
["STE3211372","OPERACIÓN DE EQUIPOS DE GRABACIÓN Y MEZCLA","TÉCNICO"]
["STE3211373","OPERACIÓN DE EQUIPOS DE RADIO Y TELEVISIÓN","TÉCNICO"]
["STE7130090","OPERACIÓN DE MAQUINARIA PESADA","TÉCNICO"]
["STE3211374","OPERACIÓN DE SISTEMAS DE DIFUSIÓN SONORA","TÉCNICO"]
["STE4166626","OPERACIONES DE COMERCIO EXTERIOR","TÉCNICO"]
["STE7241426","OPERACIONES DE PERFORACIÓN","TÉCNICO"]
["STE2116621","ORGANIZACIÓN DE EVENTOS Y ESPECTÁCULOS","TÉCNICO"]
["STE4170997","OTRO PROGRAMA EN ADMINISTRACIÓN PÚBLICA","TÉCNICO"]
["STE3150997","OTRO PROGRAMA EN ANTROPOLOGÍA","TÉCNICO"]
["STE7310997","OTRO PROGRAMA EN ARQUITECTURA Y URBANISMO","TÉCNICO"]
["STE2130997","OTRO PROGRAMA EN ARTE","TÉCNICO"]
["STE2140997","OTRO PROGRAMA EN ARTESANÍA Y MANUALIDADES","TÉCNICO"]
["STE9210997","OTRO PROGRAMA EN ASISTENCIA A ADULTOS MAYORES Y DISCAPACITADOS","TÉCNICO"]
["STE9220997","OTRO PROGRAMA EN ASISTENCIA A LA INFANCIA Y SERVICIOS PARA JÓVENES","TÉCNICO"]
["STE3230997","OTRO PROGRAMA EN BIBLIOTECOLOGÍA Y ARCHIVO","TÉCNICO"]
["STE5110997","OTRO PROGRAMA EN BIOLOGÍA","TÉCNICO"]
["STE6110997","OTRO PROGRAMA EN CIENCIAS DE LA COMPUTACIÓN","TÉCNICO"]
["STE3220997","OTRO PROGRAMA EN CIENCIAS DE LA COMUNICACIÓN","TÉCNICO"]
["STE5320997","OTRO PROGRAMA EN CIENCIAS DE LA TIERRA","TÉCNICO"]
["STE3120997","OTRO PROGRAMA EN CIENCIAS POLÍTICAS","TÉCNICO"]
["STE4180997","OTRO PROGRAMA EN COMPETENCIAS LABORALES","TÉCNICO"]
["STE7320997","OTRO PROGRAMA EN CONSTRUCCIÓN E INGENIERÍA CIVIL","TÉCNICO"]
["STE4110997","OTRO PROGRAMA EN CONTABILIDAD E IMPUESTOS","TÉCNICO"]
["STE0130997","OTRO PROGRAMA EN DEPORTE","TÉCNICO"]
["STE4220997","OTRO PROGRAMA EN DERECHO PRIVADO","TÉCNICO"]
["STE4210997","OTRO PROGRAMA EN DERECHO PÚBLICO","TÉCNICO"]
["STE2120997","OTRO PROGRAMA EN DISEÑO INDUSTRIAL, DE MODAS E INTERIORES","TÉCNICO"]
["STE5210997","OTRO PROGRAMA EN ECOLOGÍA Y MEDIO AMBIENTE","TÉCNICO"]
["STE3110997","OTRO PROGRAMA EN ECONOMÍA","TÉCNICO"]
["STE1610997","OTRO PROGRAMA EN EDUCACIÓN ARTÍSTICA","TÉCNICO"]
["STE1410997","OTRO PROGRAMA EN EDUCACIÓN ESPECIAL","TÉCNICO"]
["STE1510997","OTRO PROGRAMA EN EDUCACIÓN FÍSICA","TÉCNICO"]
["STE1110997","OTRO PROGRAMA EN EDUCACIÓN INICIAL","TÉCNICO"]
["STE0310997","OTRO PROGRAMA EN EDUCACIÓN MILITAR Y DE DEFENSA","TÉCNICO"]
["STE1120997","OTRO PROGRAMA EN EDUCACIÓN PRIMARIA","TÉCNICO"]
["STE1210997","OTRO PROGRAMA EN EDUCACIÓN SECUNDARIA","TÉCNICO"]
["STE1310997","OTRO PROGRAMA EN EDUCACIÓN SUPERIOR Y TECNOLÓGICA","TÉCNICO"]
["STE7110997","OTRO PROGRAMA EN ELECTRICIDAD Y ENERGÍA","TÉCNICO"]
["STE7120997","OTRO PROGRAMA EN ELECTRÓNICA Y AUTOMATIZACIÓN","TÉCNICO"]
["STE9130997","OTRO PROGRAMA EN ENFERMERÍA","TÉCNICO"]
["STE5420997","OTRO PROGRAMA EN ESTADÍSTICA","TÉCNICO"]
["STE9170997","OTRO PROGRAMA EN FARMACIA","TÉCNICO"]
["STE2230997","OTRO PROGRAMA EN FILOSOFÍA Y ETICA","TÉCNICO"]
["STE5330997","OTRO PROGRAMA EN FÍSICA","TÉCNICO"]
["STE4120997","OTRO PROGRAMA EN GESTIÓN FINANCIERA, ADMINISTRACIÓN BANCARIA Y SEGUROS","TÉCNICO"]
["STE4130997","OTRO PROGRAMA EN GESTIÓN Y ADMINISTRACIÓN","TÉCNICO"]
["STE1910997","OTRO PROGRAMA EN GESTIÓN Y CALIDAD EDUCATIVA","TÉCNICO"]
["STE2220997","OTRO PROGRAMA EN HISTORIA Y ARQUEOLOGÍA","TÉCNICO"]
["STE8120997","OTRO PROGRAMA EN HORTICULTURA","TÉCNICO"]
["STE0120997","OTRO PROGRAMA EN HOTELERÍA, RESTAURANTES Y GASTRONOMÍA","TÉCNICO"]
["STE2310997","OTRO PROGRAMA EN IDIOMAS","TÉCNICO"]
["STE7220997","OTRO PROGRAMA EN INDUSTRIA Y PRODUCTOS TRANSFORMADOS (EXCEPTO ALIMENTOS, TEXTIL, AGRO, MINAS Y PETRÓLEO)","TÉCNICO"]
["STE7210997","OTRO PROGRAMA EN INDUSTRIAS ALIMENTARIAS","TÉCNICO"]
["STE7330997","OTRO PROGRAMA EN INGENIERÍA SANITARIA","TÉCNICO"]
["STE5430997","OTRO PROGRAMA EN INVESTIGACIÓN OPERATIVA","TÉCNICO"]
["STE2320997","OTRO PROGRAMA EN LINGÜÍSTICA Y LITERATURA","TÉCNICO"]
["STE4140997","OTRO PROGRAMA EN MARKETING Y PUBLICIDAD","TÉCNICO"]
["STE5410997","OTRO PROGRAMA EN MATEMÁTICA","TÉCNICO"]
["STE7130997","OTRO PROGRAMA EN MECÁNICA Y METALÚRGICA","TÉCNICO"]
["STE9120997","OTRO PROGRAMA EN MEDICINA","TÉCNICO"]
["STE7240997","OTRO PROGRAMA EN MINERÍA Y EXTRACCIÓN","TÉCNICO"]
["STE2150997","OTRO PROGRAMA EN MÚSICA Y ARTES ESCÉNICAS","TÉCNICO"]
["STE4160997","OTRO PROGRAMA EN NEGOCIOS INTERNACIONALES","TÉCNICO"]
["STE9180997","OTRO PROGRAMA EN NUTRICIÓN","TÉCNICO"]
["STE9140997","OTRO PROGRAMA EN OBSTETRICIA","TÉCNICO"]
["STE9110997","OTRO PROGRAMA EN ODONTOLOGÍA","TÉCNICO"]
["STE0110997","OTRO PROGRAMA EN PELUQUERÍA Y TRATAMIENTOS DE BELLEZA","TÉCNICO"]
["STE3210997","OTRO PROGRAMA EN PERIODISMO Y LOCUCIÓN","TÉCNICO"]
["STE8310997","OTRO PROGRAMA EN PESCA","TÉCNICO"]
["STE8110997","OTRO PROGRAMA EN PRODUCCIÓN AGRÍCOLA Y GANADERA","TÉCNICO"]
["STE7230997","OTRO PROGRAMA EN PRODUCCIÓN TEXTIL Y CONFECCIONES","TÉCNICO"]
["STE0320997","OTRO PROGRAMA EN PROTECCIÓN DE LAS PERSONAS Y DE PROPIEDAD","TÉCNICO"]
["STE3130997","OTRO PROGRAMA EN PSICOLOGÍA","TÉCNICO"]
["STE5310997","OTRO PROGRAMA EN QUÍMICA","TÉCNICO"]
["STE5220997","OTRO PROGRAMA EN RECURSOS HÍDRICOS","TÉCNICO"]
["STE2210997","OTRO PROGRAMA EN RELIGIÓN Y TEOLOGÍA","TÉCNICO"]
["STE0220997","OTRO PROGRAMA EN SALUD Y PROTECCIÓN LABORAL","TÉCNICO"]
["STE0210997","OTRO PROGRAMA EN SANEAMIENTO DE LA COMUNIDAD","TÉCNICO"]
["STE4150997","OTRO PROGRAMA EN SECRETARIADO Y TRABAJO DE OFICINA","TÉCNICO"]
["STE0410997","OTRO PROGRAMA EN SERVICIOS DE TRANSPORTE","TÉCNICO"]
["STE8210997","OTRO PROGRAMA EN SILVICULTURA","TÉCNICO"]
["STE6120997","OTRO PROGRAMA EN SISTEMAS Y CÓMPUTO","TÉCNICO"]
["STE3140997","OTRO PROGRAMA EN SOCIOLOGÍA Y ESTUDIOS CULTURALES","TÉCNICO"]
["STE2110997","OTRO PROGRAMA EN TÉCNICAS AUDIOVISUALES Y DE PRODUCCIÓN PARA MEDIOS DE COMUNICACIÓN","TÉCNICO"]
["STE9150997","OTRO PROGRAMA EN TECNOLOGÍA DE DIAGNÓSTICO Y TRATAMIENTO MÉDICO","TÉCNICO"]
["STE6130997","OTRO PROGRAMA EN TELECOMUNICACIONES","TÉCNICO"]
["STE9160997","OTRO PROGRAMA EN TERAPIA Y REHABILITACIÓN","TÉCNICO"]
["STE9230997","OTRO PROGRAMA EN TRABAJO SOCIAL","TÉCNICO"]
["STE7140997","OTRO PROGRAMA EN VEHÍCULOS, BARCOS Y AERONAVES MOTORIZADAS","TÉCNICO"]
["STE8410997","OTRO PROGRAMA EN VETERINARIA","TÉCNICO"]
["STE0140997","OTRO PROGRAMA EN VIAJES, TURISMO Y ACTIVIDADES RECREATIVAS","TÉCNICO"]
["STE4190997","OTROS PROGRAMAS EN ADMINISTRACIÓN Y COMERCIO","TÉCNICO"]
["STE1990997","OTROS PROGRAMAS EN EDUCACIÓN","TÉCNICO"]
["STE0126502","OTROS PROGRAMAS EN HOSTELERÍA , RESTAURANTES Y GASTRONOMÍA","TÉCNICO"]
["STE9190997","OTROS PROGRAMAS EN SALUD","TÉCNICO"]
["STE7211406","PANADERÍA Y PASTELERÍA INDUSTRIAL","TÉCNICO"]
["STE7211407","PANIFICACIÓN","TÉCNICO"]
["STE0121384","PASTELERÍA","TÉCNICO"]
["STE7211386","PASTELERÍA Y TURISMO","TÉCNICO"]
["STE7320184","PLANEAMIENTO Y CONTROL DE PROYECTOS DE CONSTRUCCIÓN","TÉCNICO"]
["STE6116171","PLATAFORMAS Y SERVICIOS DE TECNOLOGÍAS DE LA INFORMACIÓN","TÉCNICO"]
["STE0220141","PREVENCIÓN DE LA SEGURIDAD Y SALUD EN EL TRABAJO","TÉCNICO"]
["STE0226098","PREVENCIÓN DE RIESGO, SEGURIDAD Y SALUD OCUPACIONAL","TÉCNICO"]
["STE7241427","PROCESAMIENTO DE MINERALES","TÉCNICO"]
["STE7136099","PROCESOS METALÚRGICOS Y QUÍMICOS","TÉCNICO"]
["STE8116511","PRODUCCIÓN AGROPECUARIA","TÉCNICO"]
["STE2136627","PRODUCCIÓN GRÁFICA","TÉCNICO"]
["STE7211408","PRODUCCIÓN INDUSTRIAL DE VINOS, PISCOS Y OTROS PRODUCTOS AFINES","TÉCNICO"]
["STE3221370","PRODUCCIÓN RADIAL Y TELEVISIVA","TÉCNICO"]
["STE6126623","PROGRAMACIÓN DE SISTEMAS DE INFORMACIÓN","TÉCNICO"]
["STE3131369","PSICOTERAPIA PSICOANALÍTICA","TÉCNICO"]
["STE4141367","PUBLICIDAD Y MEDIOS DIGITALES","TÉCNICO"]
["STE7121415","REFRIGERACIÓN Y AIRE ACONDICIONADO","TÉCNICO"]
["STE7331429","SEGURIDAD MINERA E INDUSTRIAL","TÉCNICO"]
["STE0220203","SEGURIDAD Y SALUD EN EL TRABAJO","TÉCNICO"]
["STE7130205","SERVICIO DE MANTENIMIENTO DE EQUIPO PESADO","TÉCNICO"]
["STE0121387","SERVICIO DE RESTAURANTE Y BAR","TÉCNICO"]
["STE0120048","SERVICIOS HOTELEROS Y COCINA","TÉCNICO"]
["STE6130142","SISTEMAS DE TELECOMUNICACIONES DE VOZ Y DATOS","TÉCNICO"]
["STE2310106","TÉCNICO TRILINGÜE EN GESTIÓN EMPRESARIAL","TÉCNICO"]
["STE2211366","TEOLOGÍA PASTORAL","TÉCNICO"]
["STE7321445","TOPOGRAFÍA CIVIL Y MINERA","TÉCNICO"]
["STE7321444","TOPOGRAFÍA","TÉCNICO"]
["STE0411460","TRANSPORTES TERRESTRES Y OPERACIÓN DE EQUIPOS PESADOS","TÉCNICO"]
["STE8110033","VITICULTURA Y ENOLOGÍA","TÉCNICO"]
["STEAG99999","OTROS TÉCNICO","TÉCNICO"]
[]
[]
[]
["Código de Nivel"]
["15: Prof. Pedagógica"]
["25: Prof. Artístico"]
["34: Prof. Tecnológica"]
["43: Prof. Técnico"]
["52: IEST- Técnico"]
["62: ETP-Técnico"]
["71: ETP-Aux. Técnico"]

{"sheet":"S104","index":2,"n_rows":200,"n_cols":35,"rows_kept":200,"cut":false,"hidden":false,"merged":[[146,9,146,12],[166,8,166,11],[49,15,49,16],[50,15,50,16],[51,15,51,16],[52,15,52,16],[53,15,53,16],[54,15,54,16],[55,15,55,16],[56,15,56,16],[57,15,57,16],[58,15,58,16],[59,15,59,16],[60,15,60,16],[61,15,61,16],[62,15,62,16],[63,15,63,16],[64,15,64,16],[65,15,65,16],[66,15,66,16],[67,15,67,16],[76,7,76,8],[76,13,76,16],[79,10,79,12],[95,7,95,8],[112,19,112,20],[116,19,116,20],[110,17,110,19],[97,13,97,16],[79,13,79,16],[80,13,80,16],[81,13,81,16],[82,13,82,16],[83,13,83,16],[84,13,84,16],[85,13,85,16],[86,13,86,16],[87,13,87,16],[88,13,88,16],[89,13,89,16],[90,13,90,16],[91,13,91,16],[92,13,92,16],[93,13,93,16],[94,13,94,16],[95,13,95,16],[96,13,96,16],[89,19,89,20],[91,7,91,8],[92,7,92,8],[93,7,93,8],[94,7,94,8],[80,10,80,12],[81,10,81,12],[82,10,82,12],[83,10,83,12],[84,10,84,12],[85,10,85,12],[86,10,86,12],[87,10,87,12],[82,19,82,20],[91,19,91,20],[92,19,92,20],[93,19,93,20],[94,19,94,20],[95,19,95,20],[96,19,96,20],[88,10,88,12],[89,10,89,12],[90,10,90,12],[91,10,91,12],[92,10,92,12],[93,10,93,12],[94,10,94,12],[90,19,90,20],[33,15,33,16],[34,15,34,16],[35,15,35,16],[36,15,36,16],[37,15,37,16],[38,15,38,16],[39,15,39,16],[76,19,76,20],[76,10,76,12],[40,15,40,16],[46,15,46,16],[42,15,42,16],[43,15,43,16],[44,15,44,16],[45,15,45,16],[19,15,19,16],[20,15,20,16],[21,15,21,16],[22,15,22,16],[23,15,23,16],[25,15,25,16],[26,15,26,16],[27,15,27,16],[28,15,28,16],[1,7,1,18],[2,7,2,18],[17,14,18,14],[17,15,18,16],[17,17,18,17],[17,18,17,19],[17,5,18,5],[17,6,18,7],[17,9,18,9],[31,15,31,16],[32,15,32,16],[24,15,24,16],[114,19,114,20],[98,19,98,20],[85,19,85,20],[86,19,86,20],[77,18,78,18],[77,19,78,20],[80,19,80,20],[81,19,81,20],[83,19,83,20],[84,19,84,20],[77,17,78,17],[77,13,78,16],[97,19,97,20],[87,19,87,20],[88,19,88,20],[79,19,79,20],[41,15,41,16],[48,15,48,16],[47,15,47,16],[29,15,29,16],[30,15,30,16],[98,10,98,12],[97,10,97,12],[95,10,95,12],[96,10,96,12],[98,13,98,16],[77,5,77,6],[77,7,78,8],[77,9,78,9],[77,10,78,12],[79,7,79,8],[80,7,80,8],[81,7,81,8],[82,7,82,8],[98,7,98,8],[97,7,97,8],[83,7,83,8],[84,7,84,8],[85,7,85,8],[96,7,96,8],[86,7,86,8],[87,7,87,8],[88,7,88,8],[89,7,89,8],[90,7,90,8]]}
[]
[null,null,null,null,null,null,null,"CENSO EDUCATIVO 2024"]
[null,null,null,null,null,null,null,"LOCAL EDUCATIVO"]
[]
[]
[]
[null,null,null,null,null,"B. INFORMACIÓN GENERAL DE LOS TERRENOS Y DEL ÁREA GENERAL DEL LOCAL EDUCATIVO"]
[]
[null,null,null,null,null,null,"103. CANTIDAD DE TERRENOS QUE TIENE EL LOCAL EDUCATIVO"]
[]
[null,null,null,null,null,null,"104. CANTIDAD DE EDIFICACIONES QUE TIENE EL LOCAL EDUCATIVO"]
[]
[null,null,null,null,"2. ÁREA DE TERRENO Y ÁREA TECHADA DEL LOCAL EDUCATIVO"]
[null,null,null,null,null,null,null,null,null,"Enteros",null,"Decimales",null,null,null,null,null,"Enteros",null,"Decimales"]
[null,null,null,null,"105. ÁREA TOTAL DEL TERRENO:",null,null,null,null,null,null,null,"m2",null,"106. ÁREA TECHADA TOTAL:",null,null,{"$f":"SUM(K20:K68,S20:S68)+INT(SUM(L20:L68,T20:T68)/100)","v":0},null,{"$f":"MOD(SUM(L20:L68,T20:T68),100)","v":0},"m2"]
[null,null,null,null,null,null,null,null,null,"Desde 20 hasta 150,000",null,"Desde 0 hasta 99",null,null,null,null,null,"Desde 20 hasta 150,000",null,"Desde 0 hasta 99"]
[null,null,null,null,"106.1. ÁREA TECHADA POR TERRENO, EDIFICACIÓN Y PISO:"]
[null,null,null,null,null,"TERRENO","EDIFICACIÓN",null,null,"Nº PISO","Área techada (m2)",null,null,null,"TERRENO","EDIFICACIÓN",null,"Nº PISO","Área techada (m2)"]
[null,null,null,null,null,null,null,null,null,null,"Enteros","Decimales",{"$f":"COUNTA(F20:F68)","v":0},null,null,null,null,null,"Enteros","Decimales",{"$f":"COUNTA(O20:O68)","v":0},null,null,null,null,null,null,null,null,null,null,null,{"$f":"SUM(AG20:AG117)","v":0},null,{"$f":"SUM(AI20:AI117)","v":0}]
[1,{"$f":"COUNTA(F20:L20)","v":0},{"$f":"COUNTA(O20:T20)","v":0},null,"01",null,null,null,null,null,null,null,null,"50",null,null,null,null,null,null,null,null,null,null,null,null,null,1,{"$f":"IF(AB20<=$O$9,CONCATENATE(\"TE0\",AB20),\"X\")","v":"X"},1,{"$f":"IF(AD20<=$O$11,CONCATENATE(\"E0\",AD20),\"X\")","v":"X"},{"$f":"CONCATENATE(F20,H20,J20)","v":""},{"$f":"IF($AF20<>\"\",COUNTIF($AF$20:$AF$117,$AF20),0)","v":0},null,{"$f":"IF(L20<>\"\",K20+(L20/100),0)","v":0}]
[2,{"$f":"COUNTA(F21:L21)","v":0},0,null,"02",null,null,null,null,null,null,null,null,"51",null,null,null,null,null,null,null,null,null,null,null,null,null,2,{"$f":"IF(AB21<=$O$9,CONCATENATE(\"TE0\",AB21),\"X\")","v":"X"},2,"X",{"$f":"CONCATENATE(F21,H21,J21)","v":""},{"$f":"IF($AF21<>\"\",COUNTIF($AF$20:$AF$117,$AF21),0)","v":0},null,{"$f":"IF(L21<>\"\",K21+(L21/100),0)","v":0}]
[3,{"$f":"COUNTA(F22:L22)","v":0},0,null,"03",null,null,null,null,null,null,null,null,"52",null,null,null,null,null,null,null,null,null,null,null,null,null,3,"X",3,"X","",{"$f":"IF($AF22<>\"\",COUNTIF($AF$20:$AF$117,$AF22),0)","v":0},null,0]
[4,0,0,null,"04",null,null,null,null,null,null,null,null,"53",null,null,null,null,null,null,null,null,null,null,null,null,null,4,"X",4,"X","",0,null,0]
[5,0,0,null,"05",null,null,null,null,null,null,null,null,"54",null,null,null,null,null,null,null,null,null,null,null,null,null,5,"X",5,"X","",0,null,0]
[6,0,0,null,"06",null,null,null,null,null,null,null,null,"55",null,null,null,null,null,null,null,null,null,null,null,null,null,6,"X",6,"X","",0,null,0]
[7,0,0,null,"07",null,null,null,null,null,null,null,null,"56",null,null,null,null,null,null,null,null,null,null,null,null,null,7,{"$f":"IF(AB26<=$O$9,CONCATENATE(\"TE0\",AB26),\"X\")","v":"X"},7,"X","",0,null,0]
[8,0,0,null,"08",null,null,null,null,null,null,null,null,"57",null,null,null,null,null,null,null,null,null,null,null,null,null,8,{"$f":"IF(AB27<=$O$9,CONCATENATE(\"TE0\",AB27),\"X\")","v":"X"},8,"X","",0,null,0]
[9,0,0,null,"09",null,null,null,null,null,null,null,null,"58",null,null,null,null,null,null,null,null,null,null,null,null,null,9,"X",9,"X","",0,null,0]
[10,0,0,null,"10",null,null,null,null,null,null,null,null,"59",null,null,null,null,null,null,null,null,null,null,null,null,null,10,{"$f":"IF(AB29<=$O$9,CONCATENATE(\"TE\",AB29),\"X\")","v":"X"},10,{"$f":"IF(AD29<=$O$11,CONCATENATE(\"E\",AD29),\"X\")","v":"X"},"",0,null,0]
[11,0,0,null,"11",null,null,null,null,null,null,null,null,"60",null,null,null,null,null,null,null,null,null,null,null,null,null,11,{"$f":"IF(AB30<=$O$9,CONCATENATE(\"TE\",AB30),\"X\")","v":"X"},11,{"$f":"IF(AD30<=$O$11,CONCATENATE(\"E\",AD30),\"X\")","v":"X"},"",0,null,0]
[12,0,0,null,"12",null,null,null,null,null,null,null,null,"61",null,null,null,null,null,null,null,null,null,null,null,null,null,12,"X",12,"X","",0,null,0]
[13,0,0,null,"13",null,null,null,null,null,null,null,null,"62",null,null,null,null,null,null,null,null,null,null,null,null,null,13,"X",13,"X","",0,null,0]
[14,0,0,null,"14",null,null,null,null,null,null,null,null,"63",null,null,null,null,null,null,null,null,null,null,null,null,null,14,"X",14,"X","",0,null,0]
[15,0,0,null,"15",null,null,null,null,null,null,null,null,"64",null,null,null,null,null,null,null,null,null,null,null,null,null,15,"X",15,"X","",0,null,0]
[16,0,0,null,"16",null,null,null,null,null,null,null,null,"65",null,null,null,null,null,null,null,null,null,null,null,null,null,16,"X",16,"X","",0,null,0]
[17,0,0,null,"17",null,null,null,null,null,null,null,null,"66",null,null,null,null,null,null,null,null,null,null,null,null,null,17,"X",17,"X","",0,null,0]
[18,0,0,null,"18",null,null,null,null,null,null,null,null,"67",null,null,null,null,null,null,null,null,null,null,null,null,null,18,"X",18,"X","",0,null,0]
[19,0,0,null,"19",null,null,null,null,null,null,null,null,"68",null,null,null,null,null,null,null,null,null,null,null,null,null,19,"X",19,"X","",0,null,0]
[20,0,0,null,"20",null,null,null,null,null,null,null,null,"69",null,null,null,null,null,null,null,null,null,null,null,null,null,20,"X",20,"X","",0,null,0]
[21,0,0,null,"21",null,null,null,null,null,null,null,null,"70",null,null,null,null,null,null,null,null,null,null,null,null,null,21,"X",21,"X","",0,null,0]
[22,0,0,null,"22",null,null,null,null,null,null,null,null,"71",null,null,null,null,null,null,null,null,null,null,null,null,null,22,"X",22,"X","",0,null,0]
[23,0,0,null,"23",null,null,null,null,null,null,null,null,"72",null,null,null,null,null,null,null,null,null,null,null,null,null,23,"X",23,"X","",0,null,0]
[24,0,0,null,"24",null,null,null,null,null,null,null,null,"73",null,null,null,null,null,null,null,null,null,null,null,null,null,24,"X",24,"X","",0,null,0]
[25,0,0,null,"25",null,null,null,null,null,null,null,null,"74",null,null,null,null,null,null,null,null,null,null,null,null,null,25,"X",25,"X","",0,null,0]
[26,0,0,null,"26",null,null,null,null,null,null,null,null,"75",null,null,null,null,null,null,null,null,null,null,null,null,null,26,"X",26,"X","",0,null,0]
[27,0,0,null,"27",null,null,null,null,null,null,null,null,"76",null,null,null,null,null,null,null,null,null,null,null,null,null,27,"X",27,"X","",0,null,0]
[28,0,0,null,"28",null,null,null,null,null,null,null,null,"77",null,null,null,null,null,null,null,null,null,null,null,null,null,28,"X",28,"X","",0,null,0]
[29,0,0,null,"29",null,null,null,null,null,null,null,null,"78",null,null,null,null,null,null,null,null,null,null,null,null,null,29,"X",29,"X","",0,null,0]
[30,0,0,null,"30",null,null,null,null,null,null,null,null,"79",null,null,null,null,null,null,null,null,null,null,null,null,null,30,"X",30,"X","",0,null,0]
[31,0,0,null,"31",null,null,null,null,null,null,null,null,"80",null,null,null,null,null,null,null,null,null,null,null,null,null,null,null,31,"X","",0,null,0]
[32,0,0,null,"32",null,null,null,null,null,null,null,null,"81",null,null,null,null,null,null,null,null,null,null,null,null,null,null,null,32,"X","",0,null,0]
[33,0,0,null,"33",null,null,null,null,null,null,null,null,"82",null,null,null,null,null,null,null,null,null,null,null,null,null,null,null,33,"X","",0,null,0]
[34,0,0,null,"34",null,null,null,null,null,null,null,null,"83",null,null,null,null,null,null,null,null,null,null,null,null,null,null,null,34,"X","",0,null,0]
[35,0,0,null,"35",null,null,null,null,null,null,null,null,"84",null,null,null,null,null,null,null,null,null,null,null,null,null,null,null,35,"X","",0,null,0]
[36,0,0,null,"36",null,null,null,null,null,null,null,null,"85",null,null,null,null,null,null,null,null,null,null,null,null,null,null,null,36,"X","",0,null,0]
[37,0,0,null,"37",null,null,null,null,null,null,null,null,"86",null,null,null,null,null,null,null,null,null,null,null,null,null,null,null,37,"X","",0,null,0]
[38,0,0,null,"38",null,null,null,null,null,null,null,null,"87",null,null,null,null,null,null,null,null,null,null,null,null,null,null,null,38,"X","",0,null,0]
[39,0,0,null,"39",null,null,null,null,null,null,null,null,"88",null,null,null,null,null,null,null,null,null,null,null,null,null,null,null,39,"X","",0,null,0]
[40,0,0,null,"40",null,null,null,null,null,null,null,null,"89",null,null,null,null,null,null,null,null,null,null,null,null,null,null,null,40,"X","",0,null,0]
[41,0,0,null,"41",null,null,null,null,null,null,null,null,"90",null,null,null,null,null,null,null,null,null,null,null,null,null,null,null,41,"X","",0,null,0]
[42,0,0,null,"42",null,null,null,null,null,null,null,null,"91",null,null,null,null,null,null,null,null,null,null,null,null,null,null,null,42,"X","",0,null,0]
[43,0,0,null,"43",null,null,null,null,null,null,null,null,"92",null,null,null,null,null,null,null,null,null,null,null,null,null,null,null,43,"X","",0,null,0]
[44,0,0,null,"44",null,null,null,null,null,null,null,null,"93",null,null,null,null,null,null,null,null,null,null,null,null,null,null,null,44,"X","",0,null,0]
[45,0,0,null,"45",null,null,null,null,null,null,null,null,"94",null,null,null,null,null,null,null,null,null,null,null,null,null,null,null,45,"X","",0,null,0]
[46,0,0,null,"46",null,null,null,null,null,null,null,null,"95",null,null,null,null,null,null,null,null,null,null,null,null,null,null,null,46,"X","",0,null,0]
[47,0,0,null,"47",null,null,null,null,null,null,null,null,"96",null,null,null,null,null,null,null,null,null,null,null,null,null,null,null,47,"X","",0,null,0]
[48,0,0,null,"48",null,null,null,null,null,null,null,null,"97",null,null,null,null,null,null,null,null,null,null,null,null,null,null,null,48,"X","",0,null,0]
[49,{"$f":"COUNTA(F68:L68)","v":0},{"$f":"COUNTA(O68:T68)","v":0},null,"49",null,null,null,null,null,null,null,null,"98",null,null,null,null,null,null,null,null,null,null,null,null,null,null,null,49,"X","",0,null,0]
[null,null,null,null,null,null,null,null,null,null,null,null,null,null,null,null,null,null,null,null,null,null,null,null,null,null,null,null,null,50,"X",{"$f":"CONCATENATE(O20,P20,R20)","v":""},0,null,{"$f":"IF(T20<>\"\",S20+(T20/100),0)","v":0}]
[null,null,null,null,"107. ¿CUENTA CON ÁREA DISPONIBLE (SIN USO) PARA FUTUROS PROYECTOS O AMPLIACIONES?",null,null,null,null,null,null,null,null,null,null,null,null,null,null,null,null,null,null,null,null,null,null,null,null,51,"X",{"$f":"CONCATENATE(O21,P21,R21)","v":""},0,null,{"$f":"IF(T21<>\"\",S21+(T21/100),0)","v":0}]
[null,null,null,null,null,null,null,null,null,null,null,null,null,null,"Enteros",null,null,"Decimales",null,null,null,null,null,null,null,null,null,null,null,52,"X",{"$f":"CONCATENATE(O22,P22,R22)","v":""},0,null,0]
[null,null,null,null,null,"No    ","","Si    ",null,null,"Especificar área disponible :",null,null,null,null,"m2",null,null,"cm2",{"$f":"+R72/100","v":0},{"$f":"O72+T72","v":0},null,null,null,null,null,null,null,null,53,"X","",0,null,0]
[null,null,null,null,null,null,null,null,null,null,null,null,null,null,"Desde 0 hasta 150,000",null,null,"Desde 0 hasta 99",null,null,null,null,null,null,null,null,null,null,null,54,"X","",0,null,0]
[null,null,null,null,null,null,null,null,null,null,null,null,null,null,null,null,null,null,null,null,null,null,null,null,null,null,null,null,null,55,"X","",0,null,0]
["Si-No",null,null,null,null,"108. SANEAMIENTO FÍSICO LEGAL",null,null,null,null,null,null,null,null,null,null,null,null,null,null,null,null,null,null,null,null,null,null,null,56,"X","",0,null,0]
["SI",null,null,null,null,"108.1. LA CONDICIÓN DE TENENCIA DEL TERRENO QUE OCUPA EL LOCAL EDUCATIVO ES:",null,null,null,null,null,null,null,null,null,null,null,null,null,null,null,null,null,null,null,null,null,null,null,57,"X","",0,null,0]
["NO",null,null,null,null,null,null,"(1)",null,"(2)","(3)",null,null,"(4)",null,null,null,"(5)","(6)","(7)",null,null,null,null,null,null,null,null,null,58,"X","",0,null,0]
[null,null,null,null,null,"TERRENOS",null,"La condición de tenencia del terreno que ocupa el local educativo es:",null,"El terreno, ¿cuenta con saneamiento Físico Legal?","Documento de posesión de terreno",null,null,"Propietario del terreno",null,null,null,"¿Se encuentra inscrito en los Registros Públicos?","N° de Partida Registral","¿Se encuentra inscrito en el Margesí de bienes del MINEDU?",null,null,null,null,null,null,null,null,null,59,"X","",0,null,0]
[null,null,null,null,null,null,null,null,null,null,null,null,null,null,null,null,null,null,null,null,null,null,null,null,null,null,null,null,null,60,"X","",0,null,0]
[1,{"$f":"IF(AND(H80=\"SI\",COUNTA(I80:M80)=0),1,0)","v":0},{"$f":"COUNTA(R80:X80)","v":3},null,null,{"$f":"IF($A80<=$O$9,\"Terreno\",\"\")","v":""},{"$f":"IF($A80<=$O$9,A80,\"\")","v":""},"",null,"","",null,null,"",null,null,null,"","","",null,null,null,null,null,null,null,null,null,61,"X","",0,null,0]
[2,{"$f":"IF(AND(H81=\"SI\",COUNTA(I81:M81)=0),1,0)","v":0},{"$f":"COUNTA(R81:X81)","v":3},null,null,"","","",null,"","",null,null,"",null,null,null,"","","",null,null,null,null,null,null,null,null,null,62,"X","",0,null,0]
[3,{"$f":"IF(AND(H82=\"SI\",COUNTA(I82:M82)=0),1,0)","v":0},{"$f":"COUNTA(R82:X82)","v":3},null,null,"","","",null,"","",null,null,"",null,null,null,"","","",null,null,null,null,null,null,null,null,null,63,"X","",0,null,0]
[4,0,3,null,null,"","","",null,"","",null,null,"",null,null,null,"","","",null,null,null,null,null,null,null,null,null,64,"X","",0,null,0]
[5,0,3,null,null,"","","",null,"","",null,null,"",null,null,null,"","","",null,null,null,null,null,null,null,null,null,65,"X","",0,null,0]
[6,0,3,null,null,"","","",null,"","",null,null,"",null,null,null,"","","",null,null,null,null,null,null,null,null,null,66,"X","",0,null,0]
[7,0,3,null,null,"","","",null,"","",null,null,"",null,null,null,"","","",null,null,null,null,null,null,null,null,null,67,"X","",{"$f":"IF($AF86<>\"\",COUNTIF($AF$20:$AF$117,$AF86),0)","v":0},null,0]
[8,0,3,null,null,"","","",null,"","",null,null,"",null,null,null,"","","",null,null,null,null,null,null,null,null,null,68,"X","",0,null,0]
[9,0,3,null,null,"","","",null,"","",null,null,"",null,null,null,"","","",null,null,null,null,null,null,null,null,null,69,"X","",0,null,0]
[10,0,3,null,null,"","","",null,"","",null,null,"",null,null,null,"","","",null,null,null,null,null,null,null,null,null,70,"X","",0,null,0]
[11,0,3,null,null,"","","",null,"","",null,null,"",null,null,null,"","","",null,null,null,null,null,null,null,null,null,71,"X","",0,null,0]
[12,0,3,null,null,"","","",null,"","",null,null,"",null,null,null,"","","",null,null,null,null,null,null,null,null,null,72,"X","",0,null,0]
[13,0,3,null,null,"","","",null,"","",null,null,"",null,null,null,"","","",null,null,null,null,null,null,null,null,null,73,"X","",0,null,0]
[14,0,3,null,null,"","","",null,"","",null,null,"",null,null,null,"","","",null,null,null,null,null,null,null,null,null,74,"X","",0,null,0]
[15,0,3,null,null,"","","",null,"","",null,null,"",null,null,null,"","","",null,null,null,null,null,null,null,null,null,75,"X","",0,null,0]
[16,0,3,null,null,"","","",null,"","",null,null,"",null,null,null,"","","",null,null,null,null,null,null,null,null,null,76,"X","",0,null,0]
[17,0,3,null,null,"","","",null,"","",null,null,"",null,null,null,"","","",null,null,null,null,null,null,null,null,null,77,"X","",0,null,0]
[18,0,3,null,null,"","","",null,"","",null,null,"",null,null,null,"","","",null,null,null,null,null,null,null,null,null,78,"X","",0,null,0]
[19,0,3,null,null,"","","",null,"","",null,null,"",null,null,null,"","","",null,null,null,null,null,null,null,null,null,79,"X","",0,null,0]
[20,0,3,null,null,"","","",null,"","",null,null,"",null,null,null,"","","",null,null,null,null,null,null,null,null,null,80,"X","",0,null,0]
[null,null,null,null,null,null,null,null,null,null,null,null,null,null,null,null,null,null,null,null,null,null,null,null,null,null,null,null,null,81,"X","",0,null,0]
[null,null,null,null,null,null,null,null,null,null,null,null,null,null,null,null,null,null,null,null,null,null,null,null,null,null,null,null,null,82,"X","",0,null,0]
[null,null,null,null,null,"109. TOPOGRAFÍA PREDOMINANTE DEL TERRENO",null,null,null,null,null,null,null,null,"112. EL LOCAL EDUCATIVO ¿CUENTA CON UN PLAN DE GESTIÓN DE RIESGO DE",null,null,null,null,null,null,null,null,null,null,null,null,null,null,83,"X","",0,null,0]
[null,null,null,null,null,null,null,null,null,null,null,null,null,null,"DESASTRES VIGENTE ANTE UN EVENTO ADVERSO? (EMERGENCIA O DESASTRE)",null,null,null,null,null,null,null,null,null,null,null,null,null,null,84,"X","",0,null,0]
[null,null,null,null,null,null,null,"Llano o plano (0-8%)",null,null,null,null,null,null,null,null,null,null,null,null,null,null,null,null,null,null,null,null,null,85,{"$f":"IF(AD104<=$O$11,CONCATENATE(\"E\",AD104),\"X\")","v":"X"},"",0,null,0]
[null,null,null,null,null,null,null,"Inclinado (9-25%)",null,null,null,null,null,null,null,null,"Sí",null,null,null,null,null,null,null,null,null,null,null,null,86,"X","",0,null,0]
[null,null,null,null,null,null,null,"Muy inclinado o desnivelado (26-50%)",null,null,null,null,null,null,null,null,null,null,null,null,null,null,null,null,null,null,null,null,null,87,"X","",0,null,0]
[null,null,null,null,null,null,null,"Accidentado, irregular o quebrada (51% a más)",null,null,null,null,null,null,null,null,null,null,null,null,null,null,null,null,null,null,null,null,null,88,"X","",0,null,0]
[null,null,null,null,null,null,null,null,null,null,null,null,null,null,null,"Documento que lo aprueba:",null,null,null,null,null,null,null,null,null,null,null,null,null,89,"X","",0,null,0]
[null,null,null,null,null,null,null,null,null,null,null,null,null,null,null,null,null,null,null,null,null,null,null,null,null,null,null,null,null,90,"X","",0,null,0]
[null,null,null,null,null,"110. TIPO DE SUELO PREDOMINANTE DEL TERRENO",null,null,null,null,null,null,null,null,null,null,"Resolución",null,null,null,null,null,null,null,null,null,null,null,null,91,"X","",0,null,0]
[null,null,null,null,null,null,null,null,null,null,null,null,null,null,null,"","Otro","",null,null,null,null,null,null,null,null,null,null,null,92,"X","",0,null,0]
[null,null,null,null,null,null,null,"1. Arena",null,null,null,null,null,null,null,null,null,null,null,null,null,null,null,null,null,null,null,null,null,93,"X","",0,null,0]
[null,null,null,null,null,null,null,"2. Arcilla",null,null,null,null,null,null,null,"Número del documento:",null,null,null,null,null,null,null,null,null,null,null,null,null,94,"X","",0,null,0]
[null,null,null,null,null,null,null,"3. Grava",null,null,null,null,null,null,null,null,null,null,null,null,null,null,null,null,null,null,null,null,null,95,"X","",0,null,0]
[null,null,null,null,null,null,null,"4. Otro",null,null,null,null,null,null,null,"Vigencia del plan:",null,null,"Desde",null,null,null,null,null,null,null,null,null,null,96,"X","",0,null,0]
[null,null,null,null,null,null,null,null,null,null,null,null,null,null,null,null,null,null,null,null,null,null,null,null,null,null,null,null,null,97,"X","",0,null,0]
[null,null,null,null,null,"111. ¿POSEE CERTIFICADO DE INSPECCIÓN TÉCNICA DE SEGURIDAD",null,null,null,null,null,null,null,null,null,null,null,null,"  Hasta",null,null,null,null,null,null,null,null,null,null,98,"X",{"$f":"CONCATENATE(O68,P68,R68)","v":""},0,null,0]
[null,null,null,null,null,"DE EDIFICACIONES (ITSE)?"]
[null,null,null,null,null,null,null,null,null,null,null,null,null,null,null,"","No"]
[null,null,null,null,null,null,null,"Sí","","No"]
[]
[]
[null,null,null,null,null,"OTROS (SEÑALIZACIÓN, ACCESIBILIDAD, Etc )"]
[null,null,null,null,null,"113.1. ACCESO MEDIANTE GRADAS Y RAMPAS (CARACTERÍSTICAS, TOMANDO COMO REFERENCIA LA PUERTA PRINCIPAL)"]
[null,null,null,null,null,"CARACTERÍSTICA DE LA GRADA"]
[null,null,null,null,null,null,"¿Cuáles son las opciones de acceso e ingreso al Local Educativo?"]
[null,null,null,null,null,null,null,"Gradas"]
[null,null,null,null,null,null,null,null,null,null,null,null,null,null,null,null,null,null,"SI - NO"]
[null,null,null,null,null,null,null,"(2) ¿La medida del paso cumple con el mínimo establecido en la norma (30 cm)?"]
[null,null,null,null,null,null,null,"(3) ¿La medida del contrapaso cumple con el máximo establecido en la norma (18 cm)?"]
[null,null,null,null,null,null,null,"(4) ¿La grada cuenta con señalización para personas con discapacidad visual (piso podotáctil) al inicio y al final?"]
[null,null,null,null,null,null,null,"(5) ¿Cuenta con baranda / pasamanos?"]
[]
[null,null,null,null,null,"CARACTERÍSTICA DE LA RAMPA"]
[null,null,null,null,null,null,"¿Cuáles son las opciones de acceso e ingreso al Local Educativo?"]
[null,null,null,null,null,null,null,"Rampa"]
[]
[null,null,null,null,null,null,null,"(6) Ancho (en metros)"]
[null,null,null,null,null,null,null,"(7) Largo (en metros)"]
[null,null,null,null,null,null,null,"(8) Alto (en metros)"]
[]
[null,null,null,null,null,null,null,"(9) ¿El piso de la rampa es homogéneo y antideslizante?"]
[null,null,null,null,null,null,null,"(10) ¿La rampa cuenta con señalización para personas con discapacidad visual (piso podotáctil) al inicio y al final?"]
[null,null,null,null,null,null,null,"(11) ¿Cuenta con baranda / pasamanos?"]
[]
[null,null,null,null,null,null,null,"Directo sin desnivel"]
[null,null,null,null,null,null,null,"Otros"]
[]
[]
[null,null,null,null,null,"113.2. ¿CÓMO SE CONECTAN LAS EDIFICACIONES Y ESPACIOS DENTRO",null,null,null,null,null,null,null,null,"114. ¿QUE TIPO DE SEÑALIZACIÓN TIENE EL LOCAL EDUCATIVO?"]
[null,null,null,null,null,"DEL LOCAL EDUCATIVO?"]
[null,null,null,null,null,null,null,null,null,null,null,null,null,null,null,"Marque con una “X” una o más opciones"]
["TABLA 01",null,null,null,null,"Marque con una “X” una o más opciones"]
["01: Propio",null,null,null,null,null,null,"Gradas",null,null,null,null,null,null,null,null,"Señalización de seguridad"]
["02: Alquilado",null,null,null,null,null,null,null,"¿Cumple con las características de",null,null,null,null,null,null,null,"Señalización visual"]
["03: Prestado",null,null,null,null,null,null,null,"acuerdo a la norma?",null,null,null,null,null,null,null,"Señalización braile y planos hápticos"]
["04: Cedido en uso",null,null,null,null,null,null,null,null,"Sí",null,null,null,null,null,null,"Señalización podotáctil"]
["05: Otro",null,null,null,null,null,null,null,null,"No",null,null,null,null,null,null,"Señales sonoras"]
[null,null,null,null,null,null,null,null,null,null,null,null,null,null,null,null,"Señales luminosas"]
["TABLA 03",null,null,null,null,null,null,"Rampa"]
["01: Ministerio de Educación",null,null,null,null,null,null,null,"¿Cumple con las características de"]
["02: Institución Educativa",null,null,null,null,null,null,null,"acuerdo a la norma?"]
["03: Gobierno Nacional",null,null,null,null,null,null,null,null,"Sí"]
["04: Gobierno Regional",null,null,null,null,null,null,null,null,"No"]
["05: Gobierno Local"]
["06: COFOPRI",null,null,null,null,null,null,"Directo sin desnivel"]
["07: Com. Campesinas,Nativas",null,null,null,null,null,null,"Otros"]
["08: Propiedad de Terceros"]
["09: No Especifica"]
["10: Otros"]
[]
[]
[]
[]
[]
[]
[]
[]
[]
["TABLA 02"]
["01: Const.Posesión Juez de Paz"]
["02: Const.Posesión Municipal"]
["03: Res. Municipal"]
["04: Res. de Afectación en uso"]
["05: Conv. con Entidad Estatal"]
["06: Conv. con Particulares"]
["07: Cont. de Arrendamiento"]
["08: Cont. de Servidumbre"]
["09: Otro"]
[]
["TABLA 04"]
["01: Escritura pública"]
["02: Minuta de compra-venta"]
["03: Minuta de donación"]
["04: Minuta de cesión"]
["05: Minuta de permuta"]
["06: Aporte reglamentario"]
["07: Res.Emitida por el Estado"]
["08: Acta Donación de CC.CN."]
["09: Otro"]

{"sheet":"S117","index":3,"n_rows":65,"n_cols":22,"rows_kept":65,"cut":false,"hidden":false,"merged":[[17,3,18,3],[17,4,18,5],[17,6,19,8],[17,13,18,13],[1,5,1,19],[2,5,2,19],[17,16,19,19],[17,14,18,15],[20,6,20,8],[20,16,20,19],[21,6,21,8],[21,16,21,19],[22,6,22,8],[22,16,22,19],[26,6,26,8],[26,16,26,19],[27,6,27,8],[27,16,27,19],[23,6,23,8],[23,16,23,19],[24,6,24,8],[24,16,24,19],[25,6,25,8],[25,16,25,19],[51,14,51,15],[48,4,48,6],[28,6,28,8],[28,16,28,19],[29,6,29,8],[29,16,29,19]]}
[]
[null,null,null,null,null,"CENSO EDUCATIVO 2024"]
[null,null,null,null,null,"LOCAL EDUCATIVO"]
[]
[]
[null,null,null,"C. DATOS COMPLEMENTARIOS ASOCIADOS A LA UBICACIÓN"]
[]
[null,null,null,"115. ACCESIBILIDAD"]
[null,null,null,null,null,null,null,null,null,null,null,null,"115.2. ¿EL LOCAL EDUCATIVO, SE ENCUENTRA UBICADO EN LA CAPITAL DISTRITAL"]
[null,null,null,"115.1. TRASLADO DESDE LA UGEL AL LOCAL EDUCATIVO",null,null,null,null,null,null,null,null,null,"DONDE SE ENCUENTRA LA UGEL?"]
[null,null,null,"¿Cuántos trayectos tiene la vía que utiliza habitualmente para"]
[null,null,null,"trasladarse desde la UGEL de su jurisdicción hasta el local educativo?",null,null,null,null,null,null,null,null,null,"Sí","Pase a la pregunta 116",null,null,null,null,"No"]
[]
[null,null,null,null,null,null,null,null,null,null,null,null,"115.3. TRASLADO DESDE TU LOCAL EDUCATIVO HASTA LA CAPITAL DISTRITAL"]
[null,null,null,null,"N° DE TRAYECTOS:"]
[null,null,null,null,null,null,null,null,null,null,null,null,"N° DE TRAYECTOS:"]
[]
[null,null,null,"Nº de ","Tiempo aproximado del trayecto",null,"Medio de transporte utilizado",null,null,null,null,null,null,"Nº de ","Tiempo aproximado del trayecto",null,"Medio de transporte utilizado"]
[]
[null,null,null,"Trayecto","Horas","minutos",null,null,null,null,null,null,null,"Trayecto","Horas","minutos"]
[1,null,null,{"$f":"IF($A21<=$G$15,A21,\"\")","v":""},null,null,null,null,null,null,null,null,null,{"$f":"IF($A21<=$P$16,A21,\"\")","v":""}]
[2,null,null,"",null,null,null,null,null,null,null,null,null,""]
[3,null,null,"",null,null,null,null,null,null,null,null,null,""]
[4,null,null,"",null,null,null,null,null,null,null,null,null,""]
[5,null,null,"",null,null,null,null,null,null,null,null,null,""]
[6,null,null,"",null,null,null,null,null,null,null,null,null,""]
[7,null,null,"",null,null,null,null,null,null,null,null,null,""]
[8,null,null,"",null,null,null,null,null,null,null,null,null,""]
[9,null,null,"",null,null,null,null,null,null,null,null,null,""]
[10,null,null,"",null,null,null,null,null,null,null,null,null,""]
[]
[null,null,null,"116. CARACTERÍSTICAS DE LA UBICACIÓN FÍSICA (Elegir SI o NO en todas las alternativas)",null,null,null,null,null,null,null,null,null,"117. PELIGROS NATURALES POTENCIALES (Marcar SI o NO todas las alternativas)"]
[]
["01: Vehicular vía asfaltada",null,null,null,null,null,null,null,null,null,"Distancia",null,null,null,null,null,null,null,null,"Última fecha de"]
["02: Vehicular vía afirmada",null,null,"Descripción",null,null,null,null,"SI - NO",null,"aprox. en mts.",null,null,"Descripción",null,null,null,"SI - NO",null,"ocurrencia",null,"¿Es mitigable?"]
["03: Vehicular trocha carrozable"]
["04: Peatonal",null,null,"1. Cercano a zona arqueológica (MC)",null,null,null,null,null,null,null,null,null,"1. Sismos"]
["05: Fluvial",null,null,"2. Cercano a faja marginal (ANA-MINAGRI)",null,null,null,null,null,null,null,null,null,"2. Lluvias intensas"]
["06: Otro",null,null,"3. Cercano a líneas o torres de alta tensión",null,null,null,null,null,null,null,null,null,"3. Sequías"]
[null,null,null,"4. Cercano a área naturales protegidas (MINAM)",null,null,null,null,null,null,null,null,null,"4. Actividades volcánicas"]
[null,null,null,"5. Inmueble de valor monumental patrimonio histórico",null,null,null,null,null,null,null,null,null,"5. Inundaciones"]
[null,null,null,"6. Sobre acumulaciones de agua subterránea a un nivel …",null,null,null,null,null,null,null,null,null,"6. Derrames de sustancias peligrosas"]
[null,null,null,"7. Humedales o zonas inundables",null,null,null,null,null,null,null,null,null,"7. Tsunamis u oleajes anómalos"]
[null,null,null,"8. Elevado en zona monumental",null,null,null,null,null,null,null,null,null,"8. Heladas"]
[null,null,null,"9. Enclavado en ambiente urbano monumental",null,null,null,null,null,null,null,null,null,"9. Granizadas"]
[null,null,null,"10. Cercano a corredor vial del sur (CVS)",null,null,null,null,null,null,null,null,null,"10. Vientos fuertes"]
[null,null,null,"11. Cercano a circuito petrolero",null,null,null,null,null,null,null,null,null,"11. Incendio forestal / urbano"]
[null,null,null,"12. Cercano a una vía de alto tránsito vehicular",null,null,null,null,null,null,null,null,null,"12. Avalanchas"]
[null,null,null,"13. Otro",null,null,null,null,null,null,null,null,null,"13. Huaycos"]
[null,null,null,null,null,null,null,null,{"$f":"COUNTIF(I37:I49,\"SI\")+COUNTIF(I37:I49,\"NO\")","v":0},null,null,null,null,"14. Deslizamientos"]
["SI",null,null,null,null,null,null,null,null,null,null,null,null,"15. Erosión"]
["NO",null,null,"118. PELIGROS POTENCIALES OCASIONADOS POR EL HOMBRE",null,null,null,null,null,null,null,null,null,"16. Otro"]
[null,null,null,"Elegir SI o NO en todas las alternativas"]
[]
[null,null,null,"Descripción",null,null,null,null,null,null,"SI - NO",null,null,"119. ¿CREE QUE LA INSTITUCIÓN EDUCATIVA DEBERÍA SER REUBICADA"]
[null,null,null,null,null,null,null,null,null,null,null,null,null,"DEBIDO A LA EXISTENCIA DE UN PELIGRO QUE NO PUEDE SER MITIGABLE?"]
[null,null,null,"1. Zona Industrial (emanación de gaces y tóxicos)"]
[null,null,null,"2. Zona minera",null,null,null,null,null,null,null,null,null,null,null,null,null,"Sí"]
[null,null,null,"3. Comercio ambulatorio intenso"]
[null,null,null,"4. Microcomercialización de droga",null,null,null,null,null,null,null,null,null,null,null,null,null,"No"]
[null,null,null,"5. Inseguridad ciudadana"]
[null,null,null,"6. Zona agrícola (quema de pastizales, abonos ...)",null,null,null,null,null,null,null,null,null,null,null,"119.1. ¿CUENTA CON LA DISPONIBILIDAD DE UN NUEVO TERRENO QUE HA"]
[null,null,null,"7. Subversión",null,null,null,null,null,null,null,null,null,null,null,"SIDO GESTIONADA PARA EL TRASLADO DE LA IE?"]
[null,null,null,"8. Zona de acopio de desperdicios (Relleno sanitario, ...)"]
[null,null,null,"9. Zona portuaria (Aeropuertos, aeródromos, ...)",null,null,null,null,null,null,null,null,null,null,null,null,null,null,null,"Sí",null,"No"]

{"sheet":"S200","index":4,"n_rows":234,"n_cols":33,"rows_kept":234,"cut":false,"hidden":false,"merged":[[203,7,203,8],[166,6,166,11],[156,24,156,26],[155,24,155,26],[76,13,78,15],[78,22,78,24],[78,25,78,27],[85,5,85,12],[29,5,29,12],[100,24,100,29],[89,20,89,30],[113,3,115,11],[113,13,115,15],[113,16,113,27],[114,16,114,27],[115,16,115,18],[115,19,115,21],[115,22,115,24],[115,25,115,27],[201,25,201,27],[202,25,202,27],[203,25,203,27],[203,9,203,14],[217,24,217,31],[1,2,1,32],[2,2,2,32],[52,11,52,14],[198,9,200,14],[42,5,42,15],[166,24,166,26],[22,25,22,27],[180,24,180,31],[165,24,165,26],[193,4,193,6],[202,7,202,8],[201,9,201,14],[197,9,197,14],[201,7,201,8],[202,9,202,14],[197,7,197,8],[198,5,200,6],[197,5,197,6],[198,7,200,8],[197,15,197,18],[198,15,200,18],[204,7,204,8],[204,9,204,14],[20,13,22,15],[22,16,22,18],[22,19,22,21],[22,22,22,24],[80,32,86,32],[45,26,46,28],[45,22,46,25],[47,26,47,28],[48,26,48,28],[49,26,49,28],[20,28,22,30],[71,25,71,30],[76,28,78,30],[76,16,76,27],[77,16,77,27],[78,16,78,18],[78,19,78,21],[20,16,20,27],[21,16,21,27],[24,32,30,32],[48,11,48,13],[53,11,53,14],[54,11,54,14],[117,32,121,32],[120,5,120,12],[113,28,115,30],[155,29,155,31],[156,29,156,31],[165,29,165,31],[166,29,166,31],[162,24,162,31],[127,29,127,31],[126,25,127,28],[150,29,150,31],[132,11,132,13],[137,11,137,14],[138,11,138,14],[139,11,139,14],[126,5,126,15],[150,19,150,22],[125,29,125,31],[204,25,204,27],[198,25,200,27],[198,28,200,30],[197,28,197,30],[197,25,197,27],[201,15,201,18],[202,15,202,18],[203,15,203,18],[204,15,204,18],[197,19,197,24],[198,19,200,24],[201,19,201,24],[202,19,202,24],[203,19,203,24],[204,19,204,24],[201,28,201,29],[202,28,202,29],[203,28,203,29],[204,28,204,29]]}
[]
[null,null,"CENSO EDUCATIVO 2024"]
[null,null,"LOCAL EDUCATIVO"]
[]
[]
[null,null,"200. SERVICIOS BÁSICOS EN EL CENTRO POBLADO Y EN EL LOCAL EDUCATIVO"]
[]
[null,null,"A. SERVICIOS EN EL CENTRO POBLADO (Para cada una de las alternativas marque con un aspa “X” solo un casillero)"]
[null,null,null,"201. SERVICIOS EN EL CENTRO PROBLADO"]
[null,null,null,null,null,null,null,null,null,null,null," Sí",null," No",null,null,null,null,null,null,null,null,null,null,null,null," Sí",null," No"]
[null,null,null,null,null,null,"1. Energía eléctrica",null,null,null,null,null,null,null,null,null,null,null,"6. Posta médica o centro de salud"]
[null,null,null,null,null,null,"2. Agua potable",null,null,null,null,null,null,null,null,null,null,null,"7. Comedores populares"]
[null,null,null,null,null,null,"3. Desagüe",null,null,null,null,null,null,null,null,null,null,null,"8. Agencia bancaria"]
[null,null,null,null,null,null,"4. Internet",null,null,null,null,null,null,null,null,null,null,null,"9. Biblioteca municipal o comunal"]
[null,null,null,null,null,null,"5. Gas",null,null,null,null,null,null,null,null,null,null,null,"10. Comisaría"]
[]
[]
[null,null,"B. ABASTECIMIENTO DE AGUA QUE USA EL LOCAL EDUCATIVO"]
[null,null,null,"202. PROCEDENCIA DEL ABASTECIMIENTO DE AGUA"]
[null,null,null,"Registrar el tipo de abastecimiento de agua de mayor FRECUENCIA y el que PREDOMINA en el Local Educativo"]
[null,null,null,null,null,null,null,null,null,null,null,null,null,"A. Indicar todos los tipos de abastecimiento, que recibe en el Local Educativo, con frecuencia",null,null,"Registre por cada terreno",null,null,null,null,null,null,null,null,null,null,null,"B. ¿Cuál es el tipo de abastecimiento de agua que predomina en el Local Educativo?"]
[null,null,null,null,"Procedencia de abastecimiento de agua",null,null,null,null,null,null,null,null,null,null,null,"(Solo si tiene más de 1 terreno)"]
[null,null,null,null,null,null,null,null,null,null,null,null,{"$f":"COUNTIF(O24:O31,\"X\")","v":0},null,null,null,"Terreno - 01",null,null,"Terreno - 02",null,null,"Terreno - 03",null,null,"Terreno - 04"]
[{"$f":"CONCATENATE(O25,O26,O27,O28,O29,O30)","v":""},null,null,1,"Red pública (agua potable)",null,null,null,null,null,null,null,null,null,null,null,null,"",null,null,"",null,null,"",null,null,""]
["SALTO",null,null,2,"Pilón de uso público (agua potable)",null,null,null,null,null,null,null,null,null,null,null,null,null,null,null,null,null,null,null,null,null,null,null,null,"",null,null,"Pase a la pregunta 210"]
[{"$f":"IF(AND(A24<>\"\",O24=\"\"),\"X\",\"\")","v":""},null,null,3,"Camión cisterna u otro similar",null,null,null,null,null,null,null,null,null,null,null,null,null,null,null,null,null,null,null,null,null,null,null,null,""]
[null,null,null,4,"Pozo",null,null,null,null,null,null,null,null,null,null,null,null,"",null,null,"",null,null,"",null,null,"",null,null,""]
[null,null,null,5,"Sistema de captación de agua de lluvia",null,null,null,null,null,null,null,null,null,null,null,null,null,null,null,null,null,null,null,null,null,null,null,null,""]
[null,null,null,6,"Río, acequia, manantial u otro",null,null,null,null,null,null,null,null,null,null,null,null,null,null,null,null,null,null,null,null,null,null,null,null,""]
[null,null,null,7,"Otro",null,null,null,null,null,null,null,null,null,null,null,null,null,null,null,null,null,null,null,null,null,null,null,null,""]
[null,null,null,8,"No tiene",null,null,null,null,null,null,null,null,null,null,null,null,null,null,null,null,null,null,null,null,null,null,null,null,""]
[null,null,null,null,null,null,null,null,null,null,null,null,null,null,{"$f":"COUNTIF(O25:O31,\"X\")","v":0}]
[null,null,null,"203. ¿CUÁL ES EL TIPO DE ENTIDAD PRESTADORA DEL SERVICIO DE AGUA?",null,null,null,null,null,null,null,null,null,null,null,null,null,null,null,"208. HORARIO QUE TIENE EL SERVICIO DE AGUA POTABLE"]
[null,null,null,null,"Marque con una “X” solo una opción",null,null,null,null,null,null,null,null,null,null,null,null,null,null,null,"Marque con una “X” sólo una alternativa y complete"]
[null,null,null,null,null,"Empresa Prestadora de Servicios de Saneamiento"]
[null,null,null,null,"","Unidades de Gestión Municipal",null,null,null,null,null,null,null,null,null,null,null,null,null,null,null,null,null,null,"Todo el día: ",null,null,null,"Mañana"]
[null,null,null,null,"","Operadores especializados",null,null,null,null,null,null,null,null,null,null,null,null,null,null,null,null,null,null,"Sólo por algunas horas: ",null,null,null,"Tarde"]
[null,null,null,null,"","Organizaciones comunales",null,null,null,null,null,null,null,null,null,null,null,null,null,null,null,null,null,null,"Sólo durante el horario de clases: ",null,null,null,"Noche"]
[null,null,null,null,null,null,null,null,null,null,null,null,null,null,null,null,null,null,null,null,null,null,null,null,null,{"$f":"CONCATENATE(Z37,Z38)","v":""}]
[null,null,null,"204. DETALLE DEL NOMBRE DE LA EMPRESA PRESTADORA DEL",null,null,null,null,null,null,null,null,null,null,null,null,null,null,null,"209. ¿EL LOCAL EDUCATIVO CUENTA CON BEBEDEROS?"]
[null,null,null,null,"SERVICIO DE AGUA",null,null,null,null,null,null,null,null,null,null,null,null,null,null,null,"Considere en uso y sin uso"]
[]
[null,null,null,null,null,null,null,null,null,null,null,null,null,null,null,null,null,null,null,null,null,null,"","Si",null,null,null,null,"No"]
[]
[]
[null,null,null,"205. ¿CUÁNTOS SUMINISTROS DE AGUA POTABLE TIENE EL LOCAL",null,null,null,null,null,null,null,null,null,null,null,null,null,null,null,null,null,null,"Estado de conservación",null,null,null,"Cantidad de bebederos"]
[null,null,null,null,"EDUCATIVO?"]
[null,null,null,null,null,null,null,null,null,null,null,null,null,null,null,null,null,null,null,null,null,null,"En buen estado"]
[null,null,null,null,null,"Cantidad de suministros",null,null,null,null,null,null,null,null,{"$f":"IF(L49>0,\"X\",\"\")","v":""},null,null,null,null,null,null,null,"En regular estado"]
[null,null,null,null,null,null,null,null,null,null,null,null,null,null,null,null,null,null,null,null,null,null,"En mal estado"]
[null,null,null,"206. DETALLE EL(LOS) NÚMERO(S) DE SUMINISTRO(S)"]
[null,null,null,null,null,null,null,null,null,null,null,null,null,null,null,null,null,null,null,"210. ¿CUENTA O NO CON UN TRATAMIENTO QUE POTABILIZA EL"]
[null,null,null,null,null,"Suministro 01",null,null,null,null,null,null,null,null,null,null,null,null,null,null,"AGUA CAPTADA?"]
[null,null,null,null,null,"Suministro 02"]
[null,null,null,null,null,"Suministro 03",null,null,null,null,null,null,null,null,null,null,null,null,null,{"$f":"IF(OR(O27<>\"\",O28<>\"\",O29<>\"\"),\"X\",\"\")","v":""},null,null,"","Si",null,null,null,"","No"]
[null,null,null,null,null,null,null,null,null,null,null,{"$f":"CONCATENATE(L53,L54,L55)","v":""}]
[null,null,null,null,null,null,null,null,null,null,null,null,null,null,null,null,null,null,null,"211. SI NO TIENE CONEXIÓN A RED PÚBLICA: ¿SE HA TRAMITADO"]
[null,null,null,"207. EL LOCAL EDUCATIVO ¿CUENTA EL SERVICIO DE AGUA POTABLE TODOS",null,null,null,null,null,null,null,null,null,null,null,null,null,null,null,null,"EL ACCESO A RED PÚBLICA?"]
[null,null,null,null,"LOS DÍAS DE LA SEMANA?"]
[null,null,null,null,null,null,null,null,null,null,null,null,null,null,null,null,null,null,null,{"$f":"IF(O32>0,\"X\",\"\")","v":""},null,"Si",null,"¿Cuál es el estado de la solicitud?"]
[null,null,null,null,null,null,"Si",null,null,null,null,null,null,null,null,null,null,null,null,null,null,null,null,"Marque con una “X” solo una opción"]
[null,null,null,null,null,null,null,null,null,null,null,null,null,null,null,null,null,null,null,null,null,null,null,"Cumple con factibilidad: Con presupuesto y en proceso"]
[null,null,null,null,null,null,"No",null,null,null,null,null,null,null,null,null,null,null,null,null,null,null,null,"Cumple con factibilidad: En solicitud de presupuesto"]
[null,null,null,null,null,null,null,null,null,null,null,null,null,null,null,null,null,null,null,null,null,null,null,"No cumple con factibilidad: En proceso de subsanar"]
[null,null,null,null,null,null,null,null,null,null,null,null,null,null,null,null,null,null,null,null,null,null,null,"No cumple con factibilidad: No cuenta con requisitos"]
[null,null,null,null,null,"¿Días a la semana que tiene el servicio?",null,null,null,null,null,null,null,null,null,null,null,null,null,null,null,null,null,"No cumple con factibilidad: No cumple con requisitos"]
[null,null,null,null,null,"Marque con una “X” una o más opciones"]
[null,null,null,null,null,null,"Lu","Ma","Mi","Ju","Vi","Sá",null,null,null,null,null,null,null,null,"","No",null,"¿Por qué razones?"]
[null,null,null,null,null,null,null,null,null,null,null,null,null,null,null,null,null,null,null,null,null,null,null,"Marque con una “X” una o más opciones"]
[null,null,null,null,null,null,null,null,null,null,null,null,null,null,null,null,null,null,null,null,null,null,"","No cuenta con redes internas de desagüe"]
[null,null,null,null,null,null,null,null,null,null,null,null,null,null,null,null,null,null,null,null,null,null,"","El local no se encuentra saneado en RRPP"]
[null,null,null,null,null,null,null,null,null,{"$f":"CONCATENATE(Z37,Z38)","v":""},null,null,null,null,null,null,null,null,null,null,null,null,"","Otro",null,""]
[]
[null,null,"C. SERVICIO DE DESAGÜE QUE USA EL LOCAL EDUCATIVO"]
[null,null,null,"212. TIPO DE CONEXIÓN DE DESAGÜE"]
[null,null,null,"Marque con una “X” solo un tipo de conexión predominante; y seleccione el (los) terreno(s) que corresponda"]
[null,null,null,null,null,null,null,null,null,null,null,null,{"$f":"COUNTIF(O80:O86,\"X\")","v":0},"A. Indicar todos los tipos de conexión, que recibe en el Local Educativo, con frecuencia",null,null,"Registre por cada terreno",null,null,null,null,null,null,null,null,null,null,null,"B. ¿Cuál es el tipo de conexión de desagüe que predomina en el Local Educativo?"]
[null,null,null,null,"Tipo de conexión de desagüe",null,null,null,null,null,null,null,{"$f":"COUNTIF(O81:O87,\"X\")","v":0},null,null,null,"(Solo si tiene más de 1 terreno)"]
[null,null,null,null,null,null,null,null,null,null,null,null,{"$f":"COUNTIF(O80:O87,\"X\")","v":0},null,null,null,"Terreno - 01",null,null,"Terreno - 02",null,null,"Terreno - 03",null,null,"Terreno - 04"]
[{"$f":"CONCATENATE(O81,O82,O83,O84,O85,O86,O87,P88)","v":""},null,null,1,"Red pública",null,null,null,null,null,null,null,null,null,null,null,null,"",null,null,"",null,null,"",null,null,""]
["SALTO",null,null,2,"Río, acequia o canal",null,null,null,null,null,null,null,null,null,null,null,null,null,null,null,null,null,null,null,null,null,null,null,null,"",null,null,"Pase a la pregunta 214"]
[{"$f":"IF(AND(A80<>\"\",O80=\"\"),\"X\",\"\")","v":""},null,null,3,"Tanque séptico",null,null,null,null,null,null,null,null,null,null,null,null,null,null,null,null,null,null,null,null,null,null,null,null,""]
[null,null,null,4,"Biodigestor",null,null,null,null,null,null,null,null,null,null,null,null,"",null,null,"",null,null,"",null,null,"",null,null,""]
[null,null,null,5,"Pozo sin tratamiento",null,null,null,null,null,null,null,null,null,null,null,null,null,null,null,null,null,null,null,null,null,null,null,null,""]
[null,null,null,6,"Unidades Básicas de Saneamiento",null,null,null,null,null,null,null,null,null,null,null,null,null,null,null,null,null,null,null,null,null,null,null,null,""]
[null,null,null,7,"Otro",null,null,null,null,null,null,null,null,null,null,null,null,null,null,null,null,null,null,null,null,null,null,null,null,""]
[null,null,null,8,"No tiene",null,null,null,null,null,null,null,null,null,null,null,null,null,null,null,null,null,null,null,null,null,null,null,null,""]
[null,null,null,null,null,null,null,null,null,null,null,null,null,null,null,null,null,null,null,null,"",null,null,"",null,null,"",null,null,""]
[]
[null,null,null,"213. DETALLE DEL NOMBRE DE LA EMPRESA PRESTADORA DEL SERVICIO DE DESAGÜE"]
[]
[null,null,null,"214. SI NO TIENE CONEXIÓN A RED PÚBLICA: ¿SE HA TRAMITADO EL ACCESO A RED PÚBLICA?"]
[]
[null,null,null,{"$f":"IF(M78>0,\"X\",\"\")","v":""},null,"Si",null,null,null,null,null,null,null,null,null,null,null,"No"]
[]
[null,null,null,null,null,null,null,null,null,null,null,null,null,null,null,null,null,null,null,null,null,"¿Por qué razones?"]
[null,null,null,null,"¿Cuál es el estado de la solicitud?",null,null,null,null,null,null,null,null,null,null,null,null,null,null,null,null,"Marque con una “X” una o más opciones"]
[null,null,null,null,"Marque con una “X”solo una opción"]
[null,null,null,null,null,"Cumple con factibilidad: Con presupuesto y en proceso de instalación",null,null,null,null,null,null,null,null,null,null,null,null,null,null,null,null,"No cuenta con redes internas de desagüe"]
[null,null,null,null,null,"Cumple con factibilidad: En solicitud de presupuesto",null,null,null,null,null,null,null,null,null,null,null,null,null,null,null,null,"El local no se encuentra saneado en RRPP"]
[null,null,null,null,null,"No cumple con factibilidad: En proceso de subsanar observaciones",null,null,null,null,null,null,null,null,null,null,null,null,null,null,null,null,"Otro"]
[null,null,null,null,null,"No cumple con factibilidad: No cuenta con requisitos documentarios"]
[null,null,null,null,null,"No cumple con factibilidad: No cumple con requisitos técnicos según empresa concesionaria"]
[]
[null,null,null,"215. ¿EL LOCAL CUENTA CON UNA PLANTA DE TRATAMIENTO DE AGUAS RESIDUALES PROVENIENTES DE LA ACTIVIDAD HUMANA?"]
[]
[null,null,null,{"$f":"IF(M77>0,\"X\",\"\")","v":""},null,"Si",null,null,"¿El volumen tratado por día es mayor a 20 m3 (20 mil litros)?",null,null,null,null,null,null,null,null,null,null,null,null,null,null,"Si",null,null,null,"No"]
[]
[null,null,null,null,null,"No",null,null,"Pase a la sección 216"]
[]
[null,null,"D. SERVICIO DE ENERGÍA ELÉCTRICA QUE USA EL LOCAL EDUCATIVO"]
[null,null,null,"216. PROCEDENCIA DE LA ENERGÍA ELÉCTRICA"]
[null,null,null,"Marque con una “X” solo un tipo de abastecimiento predominante; y seleccione el (los) terreno(s) que corresponda"]
[null,null,null,"Procedencia de abastecimiento de energía eléctrica",null,null,null,null,null,null,null,null,null,"A. Indicar todos los tipos de conexión, que recibe en el Local Educativo, con frecuencia",null,null,"Registre por cada terreno",null,null,null,null,null,null,null,null,null,null,null,"B. ¿Cual es el tipo de abastecimiento de energía eléctrica que predomina en el Local Educativo?"]
[null,null,null,null,null,null,null,null,null,null,null,null,null,null,null,null,"(Solo si tiene más de 1 terreno)"]
[null,null,null,null,null,null,null,null,null,null,null,null,{"$f":"COUNTIF(O117:O122,\"X\")","v":0},null,null,null,"Terreno - 01",null,null,"Terreno - 02",null,null,"Terreno - 03",null,null,"Terreno - 04"]
[{"$f":"CONCATENATE(O118,O119,O120,#REF!,#REF!,O121,O122)","v":{"$error":"#REF!"}},null,null,1,"Red pública (De una empresa distribuidora)",null,null,null,null,null,null,null,null,null,null,null,null,"",null,null,"",null,null,"",null,null,""]
["SALTO",null,null,2,"Grupo electrógeno",null,null,null,null,null,null,null,null,null,null,null,null,null,null,null,null,null,null,null,null,null,null,null,null,"",null,null,"Pase a la preg. 224"]
[{"$f":"IF(AND(A117<>\"\",O117=\"\"),\"X\",\"\")","v":{"$error":"#REF!"}},null,null,3,"Paneles solares (energía fotovoltaica)",null,null,null,null,null,null,null,null,null,null,null,null,null,null,null,null,null,null,null,null,null,null,null,null,""]
[null,null,null,4,"Energía Eólica",null,null,null,null,null,null,null,null,null,null,null,null,null,null,null,null,null,null,null,null,null,null,null,null,""]
[null,null,null,5,"Otro",null,null,null,null,null,null,null,null,null,null,null,null,null,null,null,null,null,null,null,null,null,null,null,null,""]
[null,null,null,6,"No tiene",null,null,null,null,null,null,null,null,null,null,null,null,null,null,null,null,null,null,null,null,null,null,null,null,""]
[]
[null,null,null,"217. DETALLE DEL NOMBRE DE LA EMPRESA PRESTADORA DEL SERVICIO",null,null,null,null,null,null,null,null,null,null,null,null,null,null,null,"221 ¿CUENTA CON MEDIDOR DE SUMINISTRO DE ENERGÍA ELÉCTRICA?"]
[null,null,null,null,"\nDE ENERGÍA ELÉCTRICA"]
[null,null,null,null,null,null,null,null,null,null,null,null,null,null,null,null,null,null,null,null,null,"Si",null,null,null,"Nro.de medidores"]
[null,null,null,null,null,null,null,null,null,null,null,null,null,null,null,null,null,null,null,null,null,null,null,null,null,"Nro. de medidores en funcionamiento"]
[null,null,null,null,null,null,null,null,null,null,null,null,null,null,null,null,null,null,null,null,"","No"]
[]
[null,null,null,"218. ¿CUÁNTOS SUMINISTROS DE ENERGÍA ELÉCTRICA TIENE EL LOCAL",null,null,null,null,null,null,null,null,null,null,null,null,null,null,null,"222. EL LOCAL EDUCATIVO, ¿CUENTA CON EL SERVICIO DE ENERGÍA"]
[null,null,null,null,"EDUCATIVO?",null,null,null,null,null,null,null,null,null,null,null,null,null,null,null,"ELÉCTRICA TODOS LOS DÍAS DE LA SEMANA?"]
[]
[null,null,null,null,null,"Cantidad de suministros",null,null,null,null,null,null,null,null,null,null,null,null,null,null,null,"Si"]
[]
[null,null,null,null,null,null,null,null,null,null,null,null,null,null,null,null,null,null,null,null,null,"No"]
[null,null,null,"219. DETALLE EL(LOS) NÚMERO(S) DE SUMINISTRO(S)",null,null,null,null,null,null,null,null,null,null,null,null,null,null,null,null,null,null,null,"¿Días a la semana que tiene el servicio?"]
[null,null,null,null,null,null,null,null,null,null,null,null,null,null,null,null,null,null,null,null,null,null,null,"Marque con una “X” una o más opciones"]
[null,null,null,null,null,"Suministro 01",null,null,null,null,null,null,null,null,null,null,null,null,null,null,null,null,null,"Lu","Ma","Mi","Ju","Vi","Sá"]
[null,null,null,null,null,"Suministro 02"]
[null,null,null,null,null,"Suministro 03"]
[null,null,null,null,null,null,null,null,null,null,null,{"$f":"CONCATENATE(L138,L139,L140)","v":""},null,null,null,null,null,null,null,"223. HORARIO QUE TIENE EL SERVICIO DE ENERGÍA ELÉCTRICA"]
[null,null,null,null,null,null,null,null,null,null,null,null,null,null,null,null,null,null,null,null,"Marque con una “X” sólo una alternativa y complete"]
[null,null,null,"220. ¿QUÉ TIPO DE SISTEMA ELÉCTRICO TIENE?"]
[null,null,null,null,null,null,null,null,null,null,null,null,null,null,null,null,null,null,null,null,null,null,null,null,"Todo el día: ",null,null,null,"Mañana"]
[null,null,null,null,"Monofásico:",null,null,null,null,"Trifásico:",null,null,"",null,null,null,null,null,null,null,null,null,null,null,"Sólo por algunas horas: ",null,null,null,"Tarde"]
[null,null,null,null,null,null,null,null,null,null,null,null,null,null,null,null,null,null,null,null,null,null,null,null,"Sólo durante el horario de clases: ",null,null,null,"Noche"]
[null,null,null,null,null,null,null,null,null,null,null,null,null,null,null,null,null,null,null,null,null,null,null,null,null,{"$f":"CONCATENATE(Z145,Z146)","v":""}]
[null,null,"E. SERVICIO DE TELEFONÍA FIJA EN EL LOCAL EDUCATIVO"]
["Prefijos",null,null,"224. EL LOCAL EDUCATIVO ¿TIENE UNA LÍNEA DE TELEFONÍA FIJA?",null,null,null,null,null,null,null,null,null,null,null,null,null,"227. REGISTRE EL NÚMERO DE TELÉFONO FIJO DEL LOCAL DUCATIVO"]
["01: Lima y Callao",null,null,"Sí",null,null,"No",null,null,"Pase a la pregunta 229"]
["41: Amazonas",null,null,null,null,null,null,null,null,null,null,null,null,null,null,null,null,"Prefijo :",null,"",null,null,null,null,"Nro. de teléfono fijo:"]
["43: Ancash"]
["83: Apurimac",null,null,"224.1. ¿FUNCIONA?",null,null,null,"Sí",null,null,"No",null,null,null,null,null,null,"228. ¿QUÉ TIPO DE LÍNEA TELEFÓNICA TIENE EL DIRECTOR DE LA IE?"]
["54: Arequipa"]
["66: Ayacucho",null,null,null,null,null,null,null,null,null,null,null,null,null,null,null,null,null,null,null,null,null,null,null,"Código de operador",null,null,null,null,"Número telefónico"]
["76: Cajamarca",null,null,null,null,null,"224.2. FUNCIONA DURANTE EL HORARIO DE CLASE",null,null,null,null,null,null,null,null,null,null,null,null,null,"Conexión fija ",null,null,null,"",null,null,null,null,""]
["84: Cusco",null,null,null,null,null,null,null,null,null,null,null,null,null,null,null,null,null,null,null,"Conexión móvil ",null,null,null,"",null,null,null,null,""]
["67: Huancavelica",null,null,null,null,null,null,null,"Sí",null,null,null,"No",null,null,null,null,null,null,null,"No Tiene "]
["62: Huanuco"]
["56: Ica",null,null,"225. LA LÍNEA DE TELEFONÍA FIJA, ¿ES CONSTANTE DURANTE",null,null,null,null,null,null,null,null,null,null,null,null,null,"229. ESPECIFIQUE ALGÚN NÚMERO DE CONTACTO QUE PERMITA COMUNICARSE"]
["64: Junín",null,null,null,"LA SEMANA?",null,null,null,null,null,null,null,null,null,null,null,null,null,"CON EL DIRECTOR DE LA IE",null,null,null,null,null,"COMPLETAR SI EN LA PREGUNTA 224 MARCÓ “NO TIENE”"]
["44: La Libertad",null,null,null,null,null,null,null,"Sí",null,null,null,"No"]
["74: Lambayeque",null,null,null,null,null,null,null,null,null,null,null,null,null,null,null,null,null,null,null,"Pertenece a:"]
["65: Loreto",null,null,"226. ¿CUÁL ES EL NOMBRE DE LA EMPRESA QUE BRINDA EL SERVICIO"]
["82: Madre de Dios",null,null,null," DE TELEFONÍA FIJA EN EL LOCAL EDUCATIVO?",null,null,null,null,null,null,null,null,null,null,null,null,null,null,null,null,null,null,null,"Código de operador",null,null,null,null,"Número telefónico"]
["53: Moquegua",null,null,null,null,null,null,null,null,null,null,null,null,null,null,null,null,null,null,null,"Conexión fija "]
["63: Pasco",null,null,null,null,null,"",null,null,null,null,null,null,null,null,null,null,null,null,null,"Conexión móvil ",null,null,null,"",null,null,null,null,""]
["73: Piura"]
["51: Puno",null,"F. SERVICIO DE GAS EN EL LOCAL EDUCATIVO"]
["42: San Martín",null,null,"230. EL LOCAL EDUCATIVO, ¿CUENTA CON INSTALACIÓN",null,null,null,null,null,null,null,null,null,null,null,null,null,null,null,"231. ¿CUENTA CON EL MEDIDOR?"]
["52: Tacna",null,null,null,"DEL SERVICIO DE GAS (NATURAL O GLP POR BALON)"]
["72: Tumbes",null,null,null,null,null,null,null,null,null,null,null,null,null,null,null,null,null,null,null,null,"Sí",null,null,null,null,"No"]
["61: Ucayali",null,null,"Sí",null,null,"No",null,null,null,"Pase a la pregunta 234"]
[null,null,null,null,null,null,null,null,null,null,null,null,null,null,null,null,null,null,null,"232. ¿TIPO DE GAS?"]
[]
[null,null,null,"230.1. ¿FUNCIONA?",null,null,null,"Sí",null,null,"No",null,null,null,null,null,null,null,null,null,null,"GLP (gas licuado de petróleo)",null,null,null,null,null,null,null,"GN (gas natural)"]
[]
[null,null,null,null,null,null,null,null,null,null,null,null,null,null,null,null,null,null,null,"233. NOMBRE DE EMPRESA CONCESIONARIA / ADMINISTRADORA DEL"]
[null,null,null,null,null,null,null,"230.2. FUNCIONA DURANTE EL HORARIO DE CLASE",null,null,null,null,null,null,null,null,null,null,null,null,"SERVICIO DE GAS"]
[]
[null,null,null,null,null,null,null,null,null,null,"Sí",null,null,"No",null,null,null,null,null,null,null,null,null,null,""]
[]
[null,null,"G. SERVICIO DE INTERNET EN EL LOCAL EDUCATIVO"]
[null,null,null,"234. EL LOCAL EDUCATIVO, ¿CUENTA CON SERVICIO DE INTERNET?"]
[]
["01: BITEL",null,null,"Sí","",null,null,null,"No",null,null,null,"234.2. SI BIEN EL LOCAL EDUCATIVO NO CUENTA CON EL SERVICIO DE INTERNET, RESPONDER LAS"]
["02: CLARO",null,null,null,null,null,null,null,null,null,null,null,null,"SIGUIENTES PREGUNTAS"]
["03: ENTEL"]
["04: MOVISTAR",null,null,"234.1. INDIQUE EL NÚMERO",null,null,null,null,null,null,null,null,"El director y/o los docentes de los servicios educativos, para sus funciones"]
["05: OTRO",null,null,null,"DE LÍNEAS CONTRATADAS",null,null,null,null,null,null,null,"pedagógicas, ¿acceden regularmente a internet dentro del local educativo",null,null,null,null,null,null,null,null,null,null,null,null,null,null,"Sí",null,null,"No",""]
[null,null,null,null,"O DISPONIBLES EN ESTE",null,null,null,null,null,null,null,"desde sus propios equipos celulares (plan de datos)?"]
[null,null,null,null,"LOCAL EDUCATIVO"]
[null,null,null,null,null,null,null,null,null,null,null,null,"Los estudiantes, para sus labores académicas ¿acceden a internet desde tablets"]
[null,null,null,null,null,null,null,null,null,null,null,null,"con plan de datos (chip) adquiridas o dotadas local educativo? (ya sea en el",null,null,null,null,null,null,null,null,null,null,null,null,null,null,"Sí","",null,"No"]
[null,null,null,null,null,null,null,null,null,null,null,null,"marco de la dotación de aprendo en casa u otra)?"]
[]
[null,null,null,null,"234.3 LINEAS CONTRATADAS EN EL LOCAL EDUCATIVO"]
["01: ADSL-P (Cable telefónico)",null,null,null,"Nro","(1)",null,"(2)",null,"(3)",null,null,null,null,null,"(4)",null,null,null,"(5)",null,null,null,null,null,"(6)",null,null,"(7)"]
["02: FTTH (Fibra óptica)",null,"SI",null,null,"Nº de línea",null,"La línes se encuentra activa?",null,"Tipo de medio de transmisión (conexión)",null,null,null,null,null,"Nombre de proveedor que brinda el servicio",null,null,null,"Entidad que financia el servicio",null,null,null,null,null,"Ancho de banda en Mbps\n(según contrato)",null,null,"Velocidad garantizada\n(en %)"]
["03: HFC (Híbrido de fibra+coaxial)",null,"NO"]
["04: CABLE (Cable coaxial)"]
["05: INTERNET SATELITAL",null,"Linea 01",null,1,{"$f":"IF($E202<=$E$194,C202,\"\")","v":""},null,null,null,null,null,null,null,null,null,null,null,null,null,null,null,null,null,null,null,null,null,null,null,null,"%"]
["06: RED INALÁMBRICA WIFI",null,"Linea 02",null,2,{"$f":"IF($E203<=$E$194,C203,\"\")","v":""},null,null,null,null,null,null,null,null,null,null,null,null,null,null,null,null,null,null,null,null,null,null,null,null,"%"]
["07: INTERNET PORTATIL / USB MODEM",null,"Línea 03",null,3,{"$f":"IF($E204<=$E$194,C204,\"\")","v":""},null,null,null,null,null,null,null,null,null,null,null,null,null,null,null,null,null,null,null,null,null,null,null,null,"%"]
["08: RED INALÁMBRICA RADIOENLACE",null,"Linea 04",null,4,{"$f":"IF($E205<=$E$194,C205,\"\")","v":""},null,null,null,null,null,null,null,null,null,null,null,null,null,null,null,null,null,null,null,null,null,null,null,null,"%"]
["09: OTRO"]
[null,null,"H. OTROS SERVICIOS EN EL LOCAL EDUCATIVO"]
["01: MOVISTAR"]
["02: CLARO",null,null,"235. EL LOCAL EDUCATIVO ¿CUENTA CON MÓDULO DE CONECTIVIDAD?",null,null,null,null,null,null,null,null,null,null,null,null,null,null,null,"237. SOBRE LA ELIMINACIÓN DE LA BASURA, MARQUE LAS"]
["03: ENTEL",null,null,null,null,null,null,null,null,null,null,null,null,null,null,null,null,null,null,null,"ALTERNATIVAS QUE MÁS SE AJUSTEN A LA REALIDAD"]
["04: BITEL",null,null,null,"Sí","",null,null,"No",null,null,null,null,null,null,null,null,null,null,null,"(Marque con una “X” una o más alternativas)"]
["05: VSAT/MINEDU"]
["06: LEVEL3",null,null,"236. EL LOCAL EDUCATIVO, ¿CUENTA CON UN TÓPICO PARA ATENCIÓN",null,null,null,null,null,null,null,null,null,null,null,null,null,null,null,null,null,"1. La arrojan al camión o triciclo municipal."]
["07: WIN",null,null,null,"DE PRIMEROS AUXILIOS?",null,null,null,null,null,null,null,null,null,null,null,null,null,null,null,null,"2. La arrojan al camión o triciclo informal"]
["08: OTRO",null,null,null,null,null,null,null,null,null,null,null,null,null,null,null,null,null,null,null,null,"3. La entierran"]
[null,null,null,null,"Sí",null,null,null,"No",null,null,null,null,null,null,null,null,null,null,null,null,"4. La queman"]
[null,null,null,null,null,null,null,null,null,null,null,null,null,null,null,null,null,null,null,null,null,"5. La arrojan a cualquier lugar"]
[null,null,null,null,null,null,"236.1. EL TÓPICO, ¿SE ENCUENTRA IMPLEMENTADO?",null,null,null,null,null,null,null,null,null,null,null,null,null,null,"6. Otro",null,null,""]
[]
[null,null,null,null,null,null,null,null,"Sí",null,null,null,"No"]
[]
[]
[]
["01: MINEDU"]
["02: UNID.EJECUTORA/UGEL/DRE"]
["03: GOB. REGIONAL"]
["04: GOB. LOCAL/MUNICIPAL"]
["05: MTC (CONCESIÓN/CONVENIO)"]
["06: COMUNIDAD"]
["07: RECURSOS PROPIOS DE LA IE"]
["08: APAFA"]
["09: PERSONAL DE LA IE."]
["10: EMPRESA PRIVADA"]
["11: OTRO"]

{"sheet":"S300","index":5,"n_rows":137,"n_cols":30,"rows_kept":137,"cut":false,"hidden":false,"merged":[[41,5,42,8],[1,8,1,17],[2,8,2,17],[41,18,42,18],[41,9,42,9],[41,10,41,11],[41,17,42,17],[41,12,41,14],[41,15,42,15]]}
[]
[null,null,null,null,null,null,null,null,"CENSO EDUCATIVO 2024"]
[null,null,null,null,null,null,null,null,"LOCAL EDUCATIVO"]
[]
[]
[]
[null,null,null,null,null,"300. INFORMACIÓN GENERAL DEL CERCO PERIMÉTRICO EN EL LOCAL EDUCATIVO [Para la gestión Pública y Privada]"]
[]
[null,null,null,null,null,null,null,null,null,null,null,null,null,"Total  ","Parcial  ","No tiene "]
[null,null,null,null,null,null,null,"301. EL PERÍMETRO DEL TERRENO DEL LOCAL EDUCATIVO, ¿CUENTA CON CERCO PERIMÉTRICO?",null,null,null,null,null,"",null,"",{"$f":"CONCATENATE(N10,O10,P10)","v":""}]
[]
[]
[null,null,null,null,null,null,null,"302. NÚMERO DE TRAMOS DEL CERCO PERIMÉTRICO"]
[]
[]
[null,null,null,null,null,"Nº","(1)","CARACTERÍSTICAS DEL PERÍMETRO DEL TERRENO",null,null,"CARACTERÍSTICAS DEL CERCO PERIMÉTRICO",null,null,null,null,null,null,null,null,null,null,null,null,"CARACTERÍSTICAS DE LOS MUROS DE CONTENCIÓN"]
[null,null,null,null,null,null,"Nº de Tra- mo","(2)\nTipo de lindero","(3)\nLongitud del tramo (m)","(4)\n¿Cuenta con cerco perimétrico?","(5)\n¿Se encuentra y/o coincide con el tramo del perímetro del terreno?","(6)\nLongitud\n(del cerco perimétrico) (m)","(7)\nAltura del cerco (m)","(8)\nMaterial predominante del cerco","(9)\nEstado de conservación del cerco","(10)\nAño de ejecución del cerco","(11)\n\nEntidad Ejecutora","(12)\n\nEste tramo ¿tiene acceso?","(13)\n\nTipo de Acceso en el tramo","(14)\n\nEstructura de portada de ingreso","(15)\n\n¿Tiene portón?","(16)\n\nMaterial del portón","(17)\nEstado de conservación del portón","(18)\n¿Cuenta con muro de contención?","(19)\n¿Forma parte del cerco perimétrico?","(20)\nAño de ejecución del muro de contención","(21)\n\nEntidad Ejecutora","(22)\n\nEstructura predominante","(23)\n\nEstado de conservación"]
["Si-No",1,{"$f":"IF(AND(K18=\"SI\",COUNTA(L18:AB18)=0),1,0)","v":0},{"$f":"IF(AND(V18=\"SI\",COUNTA(W18:AA18)=0),1,0)","v":0},null,{"$f":"IF(B18<=$N$13,CONCATENATE(B18),\"\")","v":""},{"$f":"IF(B18<=$N$13,CONCATENATE(\"T0\",B18),\"\")","v":""},"","","","","","","","","","","","","","","","","","","","","","",""]
["SI",2,0,0,null,{"$f":"IF(B19<=$N$13,CONCATENATE(B19),\"\")","v":""},"","","","","","","","","","","","","","","","","","","","","","","",""]
["NO",3,0,0,null,"","","","","","","","","","","","","","","","","","","","","","","","",""]
[null,4,0,0,null,"","","","","","","","","","","","","","","","","","","","","","","",""]
[null,5,0,0,null,"","","","","","","","","","","","","","","","","","","","","","","",""]
[null,6,0,0,null,"","","","","","","","","","","","","","","","","","","","","","","",""]
[null,7,0,0,null,"","","","","","","","","","","","","","","","","","","","","","","",""]
[null,8,0,0,null,"","","","","","","","","","","","","","","","","","","","","","","",""]
[null,9,0,0,null,"","","","","","","","","","","","","","","","","","","","","","","",""]
[null,10,0,0,null,"",{"$f":"IF(B27<=$N$13,CONCATENATE(\"T\",B27),\"\")","v":""},"","","","","","","","","","","","","","","","","","","","","",""]
[null,11,0,0,null,"",{"$f":"IF(B28<=$N$13,CONCATENATE(\"T\",B28),\"\")","v":""},"","","","","","","","","","","","","","","","","","","","","",""]
[null,12,0,0,null,"","","","","","","","","","","","","","","","","","","","","","","",""]
[null,13,0,0,null,"","","","","","","","","","","","","","","","","","","","","","","",""]
[null,14,0,0,null,"","","","","","","","","","","","","","","","","","","","","","","",""]
[null,15,0,0,null,"","","","","","","","","","","","","","","","","","","","","","","",""]
[null,16,0,0,null,"","","","","","","","","","","","","","","","","","","","","","","",""]
[null,17,0,0,null,"","","","","","","","","","","","","","","","","","","","","","","",""]
[null,18,0,0,null,"","","","","","","","","","","","","","","","","","","","","","","",""]
[null,19,0,0,null,"","","","","","","","","","","","","","","","","","","","","","","",""]
[null,20,0,0,null,"","","","","","","","","","","","","","","","","","","","","","","",""]
[null,21,null,null,null,"",{"$f":"IF(B38<=$N$13,CONCATENATE(\"T\",B38),\"\")","v":""},null,"","","","","","","","","","","","","","","","","","","","",""]
[null,null,null,null,null,null,null,"","","","","","","","","","","","","","","","","","","","","",""]
[null,null,null,null,null,null,null,"303. OTROS ELEMENTOS EN EL LOCAL EDUCATIVO"]
[]
[null,null,null,null,null,"(1)\nOtros elementos",null,null,null,"(2)\n\n¿Tiene?","(3)\n¿Cuántos tiene?",null,"(4)\nCantidad de elementos en uso, según estado de conservación",null,null,"(5)\nVolumen expresado en m3","(6)\nMaterial","(7)\nFecha de instalación\n(MM/AAAA)","(8)\nEn los 2 últimos años ¿Se ha realizado limpieza y desinfección?"]
[{"$f":"COUNTIF(J44:J55,\"SI\")+COUNTIF(J44:J55,\"NO\")","v":0},"Validaciones",null,null,null,null,null,null,null,null,"Total","En uso","Bueno","Regular","Malo"]
[null,{"$f":"IF(AND(J44=\"SI\",K44=0),1,0)","v":0},{"$f":"IF(L44>K44,1,0)","v":0},{"$f":"IF(SUM(M44:O44)<>L44,1,0)","v":0},null,1,"TANQUE ELEVADO DE AGUA"]
[null,{"$f":"IF(AND(J45=\"SI\",K45=0),1,0)","v":0},{"$f":"IF(L45>K45,1,0)","v":0},0,null,2,"TANQUE CISTERNA DE AGUA"]
[null,0,0,0,null,3,"BOMBA SUMERGIBLE"]
[null,0,0,0,null,4,"TANQUE SÉPTICO"]
[null,0,0,0,null,5,"BIODIGESTOR"]
[null,0,0,0,null,6,"PARARRAYOS"]
[null,0,0,0,null,7,"SISTEMAS DE PANELES SOLARES"]
[null,0,0,0,null,8,"POZOS A TIERRA"]
[null,{"$f":"IF(AND(J52=\"SI\",K52=0),1,0)","v":0},{"$f":"IF(L52>K52,1,0)","v":0},{"$f":"IF(SUM(M52:O52)<>L52,1,0)","v":0},null,9,"CÁMARAS DE VIDEOVIGILANCIA"]
[null,{"$f":"IF(AND(J53=\"SI\",K53=0),1,0)","v":0},{"$f":"IF(L53>K53,1,0)","v":0},{"$f":"IF(SUM(M53:O53)<>L53,1,0)","v":0},null,10,"MONITORES DE VIDEOVIGILANCIA"]
[null,{"$f":"IF(AND(J54=\"SI\",K54=0),1,0)","v":0},null,null,null,11,"GRUPO ELECTRÓGENO"]
[null,0,0,0,null,12,"SISTEMA CALENTADOR DE AGUA"]
[]
[]
[]
["01: Frente"]
["02: Derecho"]
["03: Fondo"]
["04: Izquierdo"]
[""]
[""]
["01: Ladrillo/similar/bloque ..."]
["02: Adobe/tapia/quincha piedra ..."]
["03: Piedra en bloque"]
["04: Madera"]
["05: Alambre"]
["06: Malla metálica"]
["07: Cerco prefabricado"]
["08: Esfera"]
["09: Drywall"]
["10: Calaminas"]
["11: Cerco vivo"]
["12: Sin construir"]
[""]
["01: Bueno"]
["02: Regular"]
["03: Malo"]
[""]
["01: Madera"]
["02: Mallas metálicas"]
["03: Rejas metálicas"]
["04: Planchas metálicas"]
["05: Drywall"]
["06: Otro"]
[""]
[""]
["01: Concreto armado"]
["02: Metálico"]
["03: Concreto simple"]
["04: Madera"]
["05: Piedra"]
["06: Otro"]
[""]
[""]
["01: Gob. nacional"]
["02: Gob. regional"]
["03: APAFA"]
["04: Ent. cooperantes"]
["05: Empresa privada"]
["06: Otro"]
[""]
[""]
["01: Concreto reforzado"]
["02: Concreto simple"]
["03: Concreto ciclópeo"]
["04: Concreto ciclópeo con columnas ..."]
["05: Mampostería o bloques de roca ..."]
["06: Muros de gravedad flexible"]
["07: Otro"]
[]
[]
["01: Acceso plano"]
["02: Escalera y rampa"]
["03: Sólo rampa"]
[]
[]
["01: Concreto reforzado"]
["02: Concreto simple"]
["03: Concreto ciclópeo"]
["04: Concreto ciclópeo ..."]
["05: Mamposteria o bloques ..."]
["06: Muros de gravedad flexible"]
["07: Otro"]
[]
[]
["01: Sin daño"]
["02: Fisuras leves"]
["03: Fisuras moderadas ..."]
["04: Agriet. ó colapso"]
[]
[]
[]
["01: Concreto armado"]
["02: Plástico fibra …"]

{"sheet":"S400","index":6,"n_rows":135,"n_cols":94,"rows_kept":135,"cut":false,"hidden":false,"merged":[[14,11,16,11],[13,17,16,17],[13,67,16,67],[13,80,13,86],[14,89,15,90],[14,91,15,93],[15,87,16,87],[15,88,16,88],[16,89,17,89],[15,80,16,80],[15,81,16,81],[16,82,17,82],[16,83,17,83],[14,84,15,86],[16,84,17,84],[16,85,17,85],[16,86,17,86],[14,82,15,83],[16,92,17,92],[16,93,17,93],[16,90,17,90],[16,91,17,91],[13,87,13,93],[13,62,13,63],[1,8,1,19],[2,8,2,19],[6,5,6,20],[12,6,12,33],[14,52,17,52],[14,57,15,58],[16,57,17,57],[16,79,17,79],[14,75,15,76],[14,77,15,79],[15,74,16,74],[16,77,17,77],[16,78,17,78],[13,73,13,79],[16,75,17,75],[16,76,17,76],[13,54,13,61],[16,64,17,64],[15,69,16,69],[16,56,17,56],[16,60,17,60],[15,73,16,73],[13,6,16,6],[12,69,12,93],[13,7,16,7],[13,8,16,8],[13,9,16,9],[13,18,16,18],[14,10,17,10],[15,70,16,70],[13,69,13,72],[13,13,16,13],[13,14,16,14],[16,41,17,41],[14,23,15,24],[14,25,15,26],[16,23,17,23],[15,71,16,71],[16,28,17,28],[16,27,17,27],[16,40,17,40],[14,12,16,12],[14,15,16,15],[15,72,16,72],[13,68,16,68],[14,64,15,64],[15,62,17,62],[15,63,17,63],[13,65,16,65],[14,49,17,49],[14,42,17,42],[16,58,17,58],[13,53,16,53],[14,55,15,56],[14,54,17,54],[13,66,16,66],[14,62,14,63],[13,45,13,52],[16,59,17,59],[14,59,15,61],[16,61,17,61],[14,48,17,48],[14,45,17,45],[14,50,17,50],[14,51,17,51],[14,46,17,46],[14,47,17,47],[14,36,15,37],[14,38,17,38],[16,29,17,29],[16,22,17,22],[14,21,15,22],[16,21,17,21],[16,24,17,24],[15,32,17,32],[15,33,17,33],[15,34,17,34],[12,35,12,64],[13,10,13,12],[13,15,13,16],[13,19,13,26],[14,29,14,31],[13,27,13,31],[13,32,13,34],[14,39,15,41],[13,35,13,42],[14,44,17,44],[16,25,17,25],[16,26,17,26],[14,43,17,43],[16,30,17,30],[16,31,17,31],[16,39,17,39],[14,27,15,28],[14,16,16,16],[14,19,15,20],[16,19,17,19],[16,20,17,20],[14,35,17,35],[16,36,17,36],[16,37,17,37]]}
[]
[null,null,null,null,null,null,null,null,"CENSO EDUCATIVO 2024"]
[null,null,null,null,null,null,null,null,"LOCAL EDUCATIVO"]
[]
[]
[]
[null,null,null,null,null,"400. INFORMACIÓN ESPECÍFICA POR EDIFICACION EN EL LOCAL EDUCATIVO [Solo para la gestión Pública]"]
[]
[]
[null,null,null,null,null,null,null,null,"401. EDIFICACIONES EN EL LOCAL EDUCATIVO :",null,null,null,null,null,{"$f":"IF('S104'!O11>0,'S104'!O11,0)","v":0},null,"(Considere a las edificaciones EN USO y SIN USO)"]
[]
[]
[null,null,null,null,null,"Nº","CARACTERÍSTICAS DE LAS EDIFICACIONES POR BLOQUES",null,null,null,null,null,null,null,null,null,null,null,null,null,null,null,null,null,null,null,null,null,null,null,null,null,null,null,null,"ESTADO DE CONSERVACIÓN DE LAS EDIFICACIONES POR BLOQUES",null,null,null,null,null,null,null,null,null,null,null,null,null,null,null,null,null,null,null,null,null,null,null,null,null,null,null,null,null,null,null,null,null,"EQUIPOS DE SEGURIDAD EN EDIFICACIONES POR BLOQUES"]
[null,null,null,null,null,null,"(1)\n\nNº de Edificación","(2)\n\n¿En qué terreno se encuentra la edificación?","(3)\n\nLa edificación se encuentra en uso?","(4)\n\n¿La edificación\nes un\nmódulo\nprefabri- cado?","(5)\nSobre los modulares prefabricados",null,null,"(6)\n\nNro. de pisos","(7)\n\nÁrea techada total\n\n(m2)","(8)\nDatos de construcción de la obra",null,"(9)\n\n¿La edificación\nposee\nmás de\nun tipo\nde sistema\nestructural?","(10)\n\nSistema estructural predominante","(11)\nElementos estructurales",null,null,null,null,null,null,null,"(12)\nElementos no estructurales",null,null,null,null,"(13)\nLa edificación cuenta con RED INTERNA de:",null,null,"(14)\nFormas de acceso a cada edificación",null,null,null,null,null,null,null,null,null,"(15)\nEn el caso el acceso sea mediante rampa(s), indique si cuenta con las siguientes características ",null,null,null,null,null,null,null,"(16)\n\n¿Cómo se conectan los espacios interiores en un mismo piso?","(17)\nInstalaciones eléctricas",null,null,null,null,null,null,null,"(18)\nInstalaciones sanitarias (techos)",null,"(19)\nComuni- caciones","(20)\n\nLa edificación ¿Se encuen tra en riesgo de colapso o presenta riesgo estructural?","(21)\n\n¿Cuenta con un informe o certificado que diagnostique esta situación?","(22)\n\nEntidad que elabora el informe","(23)\n\nLa edificación es considerada Patrimonio Cultural","(24)\nLa edificación cuenta con:",null,null,null,"(25)\nExtintores",null,null,null,null,null,null,"(26)\nGabinete contra incendios",null,null,null,null,null,null,"(27)\nDetectores de humo"]
[null,null,null,null,null,null,null,null,null,null,"(1)\n\nAño de instala ción","(2)\n\n¿Cuál es la\nfinalidad del\nuso del\nmódulo\nprefabricado?","(3)\n\nEstado\nde\nconservación",null,null,"(1)\n\nAño de término","(2)\n\nTipo de entidad ejecutora",null,null,"(1)\nMuros",null,"(2)\nColumnas",null,"(3)\nVigas",null,"(4)\nEstructura de techos",null,"(1)\nCobertura de techos",null,"Estado de conservación",null,null,"(1)","(2)","(3)","(1)\n \n\n¿Tiene acceso directo sin desnivel?","(2)\n\n¿Tiene rampa de acceso en?",null,"(3)\n \n\n¿Tiene escalera?","(4)\nAscensor",null,null,"(5)\n\n¿Tiene otras formas de acceso?","(1)\n\n¿Cuenta con ancho mínimo 1.50 m?","(2)\n\nLongitud (m)","(3)\n\ndesnivel (m)","(4)\n\n¿Los descansos tienen una longitud mínima de largo de 1.50 m?","(5)\n\n¿El piso de la rampa es estable, compacto, uniforme y antideslizante?","(6)\n\n¿Tiene pasamanos?","(7)\n\n¿Los pasamanos cuentan con la altura de 0.85 ó 0.90?","(8)\n\n¿Tiene un pasamano adicional entre los 0.45 m y los 0.60 m de altura?","(9)\n\n¿Ei inicio y final de la rampa tiene un espacio libre de 1.50 m para el giro de una silla de ruedas?","(10)\n\n¿Cuenta con\nseñalización para personas con\ndiscapacidad visual?\n(piso podotáctil)",null,"(1)\n\nTipo de instalación del cableado","(2)\n\nTablero",null,"(3)\n\nGabinete de protección de circuitos",null,"(4)\n\nSistema de puesta a tierra",null,null,"Estado de conservación",null,"Estado de conserva- ción",null,null,null,null,null,null,null,null,null,null,"Según estado de conservación",null,"Según antigüedad en el Local Educativo",null,null,null,null,"Según estado de conservación",null,"Según antigüedad en el Local Educativo",null,null,null,null,"Según estado de conservación",null,"Según antigüedad en el Local Educativo"]
[null,null,null,null,null,null,null,null,null,null,null,null,null,null,null,null,null,null,null,null,null,null,null,null,null,null,null,null,null,"(2)","(3)","(4)","Agua","Desague","Energia Eléctrica",null,null,null,null,null,null,null,null,null,null,null,null,null,null,null,null,null,null,null,null,null,null,null,null,null,null,null,"(1)\n\nSistema de captación de agua de lluvias","(2)\n\nSistema de evacuación de agua de lluvias",null,null,null,null,null,"(1)\n\nSeñaliza- ción de seguridad","(2)\n\nAlarmas y botones de emergencia","(3)\n\nBotiquín debida- mente equipado","(4)\n\nLuces de emergencia operativas","(1)\n\nCantidad total (OPERATIVOS\n+ INOPERATIVOS)","(2)\n\nTotal Operativos",null,null,null,null,null,"(1)\n\nCantidad total (OPERATIVOS\n+ INOPERATIVOS)","(2)\n\nTotal Operativos",null,null,null,null,null,"(1)\n\nCantidad total (OPERATIVOS\n+ INOPERATIVOS)","(2)\n\nTotal Operativos"]
[null,null,null,null,null,null,null,null,null,null,null,null,null,null,null,null,null,null,null,"(1)\nMaterial predominante","(2)\nEstado de conservación","(1)\nMaterial predominante","(2)\nEstado de conservación","(1)\nMaterial predominante","(2)\nEstado de conservación","(1)\nMaterial predominante","(2)\nEstado de conservación","(1)\nMaterial predominante","(2)\nEstado de conservación","Techo y/o entrepisos","Escaleras","Parapetos",null,null,null,null,"(1)\nPrimer piso","(2)\nTodos los pisos",null,"(1)\n\n¿Tiene?","(2)\n\n¿Esta operativo?","(3)\nÚltimo año de manteni- miento?",null,null,null,null,null,null,null,null,null,null,null,null,null,"Cantidad","Estado de conserva- cion","Cantidad","Estado de conserva- cion","Cantidad","Estado de conserva- cion","Último año de manteni- miento",null,null,"(1)\nSistema de voz y data",null,null,null,null,null,null,null,null,null,null,"(3)\nEn buen estado","(4)\nNecesitan repara- ción","(5)\nMenos de 1 año","(6)\nDe 1 a 2 años","(7)\nMás de 2 años",null,null,"(3)\nEn buen estado","(4)\nNecesitan repara- ción","(5)\nMenos de 1 año","(6)\nDe 1 a 2 años","(7)\nMás de 2 años",null,null,"(3)\nEn buen estado","(4)\nNecesitan repara- ción","(5)\nMenos de 1 año","(6)\nDe 1 a 2 años","(7)\nMás de 2 años"]
[]
["SI / NO",1,{"$f":"IF(AND(J19=\"SI\",COUNTA(K19:M19)=0),1,IF(AND(J19=\"NO\",COUNTA(K19:M19)>0),1,0))","v":0},{"$f":"IF(F19<>\"\",1,0)","v":0},null,{"$f":"IF(B19<=$P$10,CONCATENATE(B19),\"\")","v":""},{"$f":"IF(B19<=$P$10,CONCATENATE(\"E0\",B19),\"\")","v":""}]
["SI",2,0,{"$f":"IF(F20<>\"\",1,0)","v":0},null,"",""]
["NO",3,0,{"$f":"IF(F21<>\"\",1,0)","v":0},null,"",""]
["No aplica",4,0,{"$f":"IF(F22<>\"\",1,0)","v":0},null,"",""]
["TABLA 01",5,0,{"$f":"IF(F23<>\"\",1,0)","v":0},null,"",""]
["01: Emergencia",6,0,{"$f":"IF(F24<>\"\",1,0)","v":0},null,"",""]
["02: Temporal",7,0,0,null,"",""]
["03: Permanentes",8,0,0,null,"",""]
[null,9,{"$f":"IF(AND(J27=\"SI\",COUNTA(K27:M27)=0),1,0)","v":0},0,null,"",""]
["TABLA 02",10,0,0,null,"",{"$f":"IF(B28<=$P$10,CONCATENATE(\"E\",B28),\"\")","v":""}]
["01: Gob. nacional",11,0,0,null,"",""]
["02: Gob. regional",12,0,0,null,"",""]
["03: Gob. Local",13,0,0,null,"",""]
["04: APAFA",14,0,0,null,"",""]
["05: Ent. cooperantes",15,0,0,null,"",""]
["06: Empresa privada",16,0,0,null,"",""]
["07: No especifica",17,0,{"$f":"IF(F35<>\"\",1,0)","v":0},null,"",""]
["TABLA XX",18,0,{"$f":"IF(F36<>\"\",1,0)","v":0},null,"",""]
["01: Rectangular o cuadrado",19,0,{"$f":"IF(F37<>\"\",1,0)","v":0},null,"",""]
["02: Hexagonal u octogonal",20,0,{"$f":"IF(F38<>\"\",1,0)","v":0},null,"",""]
["03: Irregular",21,0,{"$f":"IF(F39<>\"\",1,0)","v":0},null,"",""]
[null,22,0,0,null,"",""]
["TABLA ",23,0,0,null,"",""]
["01: Concreto armado",24,0,0,null,"",""]
["02: Albañilería confinada",25,0,0,null,"",""]
["03: Albañilería sin confinar",26,0,0,null,"",""]
["04: Adobe / tapial",27,0,0,null,"",""]
["05: Madera estructural",28,0,0,null,"",""]
["06: Acero estructural",29,0,0,null,"",""]
["07: Módulo prefabricado PRONIED",30,0,0,null,"",""]
["08: Módulo prefabricado-Otro",31,0,0,null,"",""]
["09: Precario",32,0,0,null,"",""]
["10: Otro",33,0,0,null,{"$f":"IF(B51<=$P$10,CONCATENATE(B51),\"\")","v":""},""]
["11: No tiene pero requiere",34,0,0,null,"",""]
["12: No tiene y no lo requiere",35,0,0,null,"",""]
[null,36,0,0,null,"",""]
[null,37,0,0,null,"",""]
[null,38,0,0,null,"",""]
["01: Concreto ",39,0,0,null,"",""]
["02: Madera",40,0,0,null,"",""]
["03: Teja",41,0,0,null,"",""]
["04: Fibra de cemento",42,0,0,null,"",{"$f":"IF(B60<=$P$10,CONCATENATE(\"E\",B60),\"\")","v":""}]
["05: Calamina",43,0,0,null,"",""]
["06: Calaminon",44,0,0,null,"",""]
["07: Caña con barro",45,0,0,null,"",""]
["08: Lata o latón",46,0,0,null,"",""]
["09: Otro",47,0,0,null,"",""]
["10: No tiene pero requiere",48,0,0,null,"",""]
["11: No tiene y no lo requiere",49,0,0,null,"",""]
[null,50,0,0,null,"",""]
["01: Bueno",51,0,0,null,"",""]
["02: Regular",52,0,0,null,"",""]
["03: Malo",53,0,0,null,"",""]
["04: No aplica",54,0,0,null,"",""]
[null,55,0,0,null,"",""]
[{"$f":"'S104'!AC20","v":"X"},56,0,0,null,"",""]
[{"$f":"'S104'!AC21","v":"X"},57,0,0,null,"",""]
[{"$f":"'S104'!AC22","v":"X"},58,0,0,null,"",""]
[{"$f":"'S104'!AC23","v":"X"},59,0,0,null,"",""]
[{"$f":"'S104'!AC24","v":"X"},60,0,0,null,"",""]
[{"$f":"'S104'!AC25","v":"X"},61,0,0,null,"",""]
[{"$f":"'S104'!AC26","v":"X"},62,0,0,null,"",""]
[{"$f":"'S104'!AC27","v":"X"},63,0,0,null,"",""]
[{"$f":"'S104'!AC28","v":"X"},64,0,0,null,"",""]
[{"$f":"'S104'!AC29","v":"X"},65,0,0,null,{"$f":"IF(B83<=$P$10,CONCATENATE(B83),\"\")","v":""},""]
[{"$f":"'S104'!AC30","v":"X"},66,0,0,null,"",""]
[{"$f":"'S104'!AC31","v":"X"},67,0,0,null,"",""]
[{"$f":"'S104'!AC32","v":"X"},68,0,0,null,"",""]
[{"$f":"'S104'!AC33","v":"X"},69,0,0,null,"",""]
[{"$f":"'S104'!AC34","v":"X"},70,0,0,null,"",""]
[{"$f":"'S104'!AC35","v":"X"},71,0,0,null,"",""]
[{"$f":"'S104'!AC36","v":"X"},72,0,0,null,"",""]
[{"$f":"'S104'!AC37","v":"X"},73,{"$f":"IF(AND(J91=\"SI\",COUNTA(K91:M91)=0),1,0)","v":0},0,null,"",""]
[{"$f":"'S104'!AC38","v":"X"},74,0,0,null,"",{"$f":"IF(B92<=$P$10,CONCATENATE(\"E\",B92),\"\")","v":""}]
[{"$f":"'S104'!AC39","v":"X"},75,0,0,null,"",""]
[{"$f":"'S104'!AC40","v":"X"},76,0,0,null,"",""]
[{"$f":"'S104'!AC41","v":"X"},77,0,0,null,"",""]
[{"$f":"'S104'!AC42","v":"X"},78,0,0,null,"",""]
[{"$f":"'S104'!AC43","v":"X"},79,0,0,null,"",""]
[{"$f":"'S104'!AC44","v":"X"},80,0,0,null,"",""]
[{"$f":"'S104'!AC45","v":"X"},81,0,0,null,"",""]
[{"$f":"'S104'!AC46","v":"X"},82,0,0,null,"",""]
[{"$f":"'S104'!AC47","v":"X"},83,0,0,null,"",""]
[{"$f":"'S104'!AC48","v":"X"},84,0,0,null,"",""]
[{"$f":"'S104'!AC49","v":"X"},85,0,{"$f":"IF(F103<>\"\",1,0)","v":0},null,"",""]
[null,86,0,0,null,"",""]
[null,87,0,0,null,"",""]
[null,88,0,0,null,"",""]
[null,89,0,0,null,"",""]
[null,90,0,0,null,"",""]
[null,91,0,0,null,"",""]
[null,92,0,0,null,"",""]
[null,93,0,0,null,"",""]
[null,94,0,0,null,"",""]
[null,95,0,0,null,"",""]
[null,96,0,0,null,"",""]
[null,97,0,0,null,"",""]
[null,98,0,0,null,"",""]
[null,99,0,0,null,"",""]
[null,100,0,0,null,"",""]
["TABLA 06",null,null,null,null,""]
["01: Directo",null,null,null,null,null,null,"---","---","---","---","---","---","---","---","---","---","---","---","---","---","---","---","---","---","---","---","---","---","---","---","---","---","---","---","---","---","---","---","---","---","---","---","---","---","---","---","---","---","---","---","---","---","---","---","---","---","---","---","---","---","---","---","---","---","---","---","---","---","---","---","---","---","---","---","---","---","---","---","---","---","---","---","---","---","---","---","---","---","---","---","---","---","---"]
["02: Gradas"]
["03: Rampas"]
["04: Otros"]
[]
["TABLA 07"]
["01: Circuito canalizado"]
["02: Circuito sin canalizar"]
["03: No especifica"]
[]
[]
["TABLA 08"]
["01: CENEPRED"]
["02: GOBIERNO LOCAL"]
["03: PRONOEI"]
["04: OTROS"]

{"sheet":"S500","index":7,"n_rows":328,"n_cols":155,"rows_kept":328,"cut":false,"hidden":false,"merged":[[11,16,11,17],[12,18,14,18],[12,140,12,142],[12,144,12,146],[12,148,12,150],[13,139,14,139],[13,140,14,140],[13,141,14,141],[13,142,14,142],[13,143,14,143],[13,144,14,144],[13,145,14,145],[13,146,14,146],[13,147,14,147],[13,148,14,148],[13,149,14,149],[13,150,14,150],[13,128,14,128],[13,129,14,129],[13,120,14,120],[13,121,14,121],[13,122,14,122],[13,123,14,123],[13,124,14,124],[1,19,1,37],[2,19,2,37],[13,152,14,152],[13,153,14,153],[13,154,14,154],[13,111,14,111],[13,112,14,112],[13,113,14,113],[13,114,14,114],[13,135,14,135],[13,136,14,136],[13,137,14,137],[13,138,14,138],[13,151,14,151],[13,130,14,130],[13,131,14,131],[13,132,14,132],[13,133,14,133],[13,134,14,134],[13,125,14,125],[13,126,14,126],[13,127,14,127],[13,115,14,115],[13,116,14,116],[13,117,14,117],[13,118,14,118],[13,119,14,119],[11,19,11,65],[11,111,11,154],[12,112,12,114],[12,116,12,118],[12,120,12,122],[12,124,12,126],[12,128,12,130],[12,132,12,134],[12,136,12,138],[12,152,12,154],[11,87,11,88],[11,81,11,82],[12,91,12,94],[11,83,11,84],[11,85,11,86],[11,68,11,69],[11,71,11,73],[11,74,11,75],[11,76,11,80],[13,86,14,86],[12,83,12,84],[12,19,12,45],[12,87,12,88],[13,88,14,88],[12,85,12,86],[13,89,14,89],[13,87,14,87],[12,76,12,80],[12,68,12,69],[12,71,12,73],[13,14,14,14],[13,15,14,15],[13,16,14,16],[13,84,14,84],[13,85,14,85],[13,81,14,81],[13,82,14,82],[13,80,14,80],[13,73,14,73],[13,74,14,74],[13,67,14,67],[13,83,14,83],[13,72,14,72],[13,76,14,76],[14,38,14,43],[13,37,13,45],[13,75,14,75],[13,68,14,68],[13,17,14,17],[13,78,14,78],[13,79,14,79],[13,77,14,77],[13,69,14,69],[13,70,14,70],[13,106,14,106],[13,107,14,107],[12,100,13,100],[13,103,13,105],[13,46,13,65],[14,29,14,34],[13,19,13,27],[13,28,13,36],[13,108,13,110],[12,101,13,101],[13,102,14,102],[13,96,13,98],[13,99,14,99],[12,103,12,106],[12,107,12,110],[13,91,13,93],[13,90,14,90],[13,94,14,94],[14,20,14,25],[13,95,14,95],[12,96,12,99],[12,74,12,75],[13,71,14,71],[12,81,12,82]]}
[null,null,null,null,null,null,null,null,null,null,{"$f":"IF('S100'!Y113<>\"\",'S100'!Y113,\"X\")","v":"X"},{"$f":"IF('S400'!G19<>\"\",'S400'!G19,\"X\")","v":"X"}]
[null,null,null,null,null,null,null,null,null,null,{"$f":"IF('S100'!Y114<>\"\",'S100'!Y114,\"X\")","v":"X"},{"$f":"IF('S400'!G20<>\"\",'S400'!G20,\"X\")","v":"X"},null,null,null,null,null,null,null,"CENSO EDUCATIVO 2024"]
[null,null,null,null,null,null,null,null,null,null,{"$f":"IF('S100'!Y115<>\"\",'S100'!Y115,\"X\")","v":"X"},{"$f":"IF('S400'!G21<>\"\",'S400'!G21,\"X\")","v":"X"},null,null,null,null,null,null,null,"LOCAL EDUCATIVO"]
[null,null,null,null,null,null,null,null,null,null,{"$f":"IF('S100'!Y116<>\"\",'S100'!Y116,\"X\")","v":"X"},{"$f":"IF('S400'!G22<>\"\",'S400'!G22,\"X\")","v":"X"}]
[null,null,null,null,null,null,null,null,null,null,{"$f":"IF('S100'!Y117<>\"\",'S100'!Y117,\"X\")","v":"X"},{"$f":"IF('S400'!G23<>\"\",'S400'!G23,\"X\")","v":"X"}]
[null,null,null,null,null,null,null,null,null,null,{"$f":"IF('S100'!Y118<>\"\",'S100'!Y118,\"X\")","v":"X"},{"$f":"IF('S400'!G24<>\"\",'S400'!G24,\"X\")","v":"X"},null,"500. CARACTERÍSTICAS DE LAS AULAS O ESPACIOS ACONDICIONADOS COMO AULAS EN EL LOCAL EDUCATIVO [Solo para la gestión Pública]"]
[null,null,null,null,null,null,null,null,null,null,{"$f":"IF('S100'!Y119<>\"\",'S100'!Y119,\"X\")","v":"X"},{"$f":"IF('S400'!G25<>\"\",'S400'!G25,\"X\")","v":"X"}]
["GESTIÓN",{"$f":"Gestion","v":9},null,null,null,null,null,null,null,null,{"$f":"IF('S100'!Y120<>\"\",'S100'!Y120,\"X\")","v":"X"},{"$f":"IF('S400'!G26<>\"\",'S400'!G26,\"X\")","v":"X"},null,null,null,null,null,null,"501. NÚMERO DE AULAS O ESPACIOS ACONDICIONADOS COMO AULAS",null,null,null,null,null,null,null,null,null,"TOTAL",null,null,null,null,null,null,"BUENO","REGULAR","MALO"]
[null,null,null,null,null,null,null,null,null,null,{"$f":"IF('S100'!Y121<>\"\",'S100'!Y121,\"X\")","v":"X"},{"$f":"IF('S400'!G27<>\"\",'S400'!G27,\"X\")","v":"X"},null,null,null,null,null,null,"(Considere a las aulas o espacios EN USO y SIN USO)",null,null,null,null,null,null,null,null,null,{"$f":"AJ9+AK9+AL9","v":1},null,null,null,null,null,null,1]
[null,null,null,null,null,null,null,null,null,null,{"$f":"IF('S100'!Y122<>\"\",'S100'!Y122,\"X\")","v":"X"},{"$f":"IF('S400'!G28<>\"\",'S400'!G28,\"X\")","v":"X"}]
["Turno mañana",null,null,null,null,null,null,null,null,null,{"$f":"IF('S100'!Y123<>\"\",'S100'!Y123,\"X\")","v":"X"},{"$f":"IF('S400'!G29<>\"\",'S400'!G29,\"X\")","v":"X"},null,"Registre en cada fila de la tabla las características de cada aula en uso y sin uso."]
["Turno tarde",null,null,null,null,null,null,null,null,null,{"$f":"IF('S100'!Y124<>\"\",'S100'!Y124,\"X\")","v":"X"},{"$f":"IF('S400'!G30<>\"\",'S400'!G30,\"X\")","v":"X"},null,{"$f":"SUM(D16:D215)","v":0},"(1)","(2)","(3)",null,"(4)","(5)      Niveles educativos de la Educación Básica/ETP y/o Carreras/Programas de la Educación Superior que usan el ambiente",null,null,null,null,null,null,null,null,null,null,null,null,null,null,null,null,null,null,null,null,null,null,null,null,null,null,null,null,null,null,null,null,null,null,null,null,null,null,null,null,null,null,null,null,null,null,"(6)","(7)","(8)",null,"(9)","(10)",null,null,"(11)",null,"(12)",null,null,null,null,"(13)",null,"(14)",null,"(15)",null,"(16)",null,"(17)","Tenencia y estado de conservación del mobiliario en uso en las aulas o espacios acondicionados como aulas",null,null,null,null,null,null,null,null,null,null,null,null,null,null,null,null,null,null,null,null,"(24)\nTenencia y estado de conservación del mobiliario en uso en los ambientes usados como aula de clase"]
["Turno noche",null,null,null,null,null,null,null,null,null,{"$f":"IF('S100'!Y125<>\"\",'S100'!Y125,\"X\")","v":"X"},{"$f":"IF('S400'!G31<>\"\",'S400'!G31,\"X\")","v":"X"},null,null,null,null,"(3.1)","(3.2)","¿Este ambiente de Aula de Clase es:?\n\n-Regular\n-Funcional","Cantidad de estudiantes por aula y turno",null,null,null,null,null,null,null,null,null,null,null,null,null,null,null,null,null,null,null,null,null,null,null,null,null,null,null,null,null,null,null,null,null,null,null,null,null,null,null,null,null,null,null,null,null,null,null,null,"Dimensiones de ambientes",null,null,"Puertas",null,null,"Cerraduras",null,"Ventanas",null,null,null,null,"Paredes",null,"Techo",null,"Piso",null,"Instalaciones eléctricas",null,null,null,"(18)\nMesas unipersonales",null,null,null,null,"(19)\nMesas multiples",null,null,null,"(20)\nCarpetas Unipersonales","(21)\nCarpetas Biperso- nales",null,"(22)\nSillas",null,null,null,"(23)\nPizarras",null,null,null,null,"(1)\nEscritorio docente",null,null,null,"(2)\nSilla docente",null,null,null,"(3)\nArmario",null,null,null,"(4)\nEstante",null,null,null,"(5)\nLockers",null,null,null,"(6)\nExibidores de libros",null,null,null,"(7)\nMueble Kitchenette",null,null,null,"(8)\nBaranda",null,null,null,"(9)\nCambiador",null,null,null,"(10)\nCuna",null,null,null,"(11)\nReposo de pies"]
[null,null,null,null,null,null,null,null,null,null,null,{"$f":"IF('S400'!G32<>\"\",'S400'!G32,\"X\")","v":"X"},null,"Nº","Nº de edifica-\nción","Nº de piso","El ambiente ¿Se encuentra en uso?","Cantidad de días\nen una semana que se usa el ambiente",null,"(1)\nTurno mañana",null,null,null,null,null,null,null,null,"(2)\nTurno tarde",null,null,null,null,null,null,null,null,"(3)\nTurno noche",null,null,null,null,null,null,null,null,"Carreras/Programas de Educación Superior (Según lo declarado en la tabla 102)",null,null,null,null,null,null,null,null,null,null,null,null,null,null,null,null,null,null,null,"Aforo del ambiente","¿Tiene\nforma\nde\ncuadri- látero?","(1)\n\nLargo\n(m)","(2)\n\nAncho\n (m)","¿Cuenta con señaliza- ción de seguridad?","(1)\n\nCantidad","(2)\n\nMaterial\npredominante","(3)\n\nEstado de conservación","(1)\n\nCantidad","(2)\n\nEstado de conservación","(1)\n\nCantidad","(2)\n\nMaterial predominante del marco de la ventana","(3)\n\nEstado de Conservación del marco de la ventana","(4)\n\n¿Favorecen la ventilación cruzada?","(5)\n\nEstado de Conservación\nde los vidrios","(1)\n\nMaterial\npredominante","(2)\n\nEstado de conserva-ción","(1)\n\nMaterial\npredominante","(2)\n\nEstado de conserva-ción","(1)\n\nMaterial\npredominante","(2)\n\nEstado de conserva-\nción","(1)\n\n¿Tiene?","(2)\n\nEstado de conserva-\nción","¿Cuenta con conexión a internet?","(1)\n\nCantidad total","Cantidad por estado de conservación",null,null,"(5)\n\nCantidad de estudiantes que no tienen mesas unipersonales","(1)\n\nCantidad total","Cantidad por estado de conservación",null,null,"(5)\n\nCantidad de estudiantes que no tienen mesas multiples",null,null,"(1)\n\nCantidad total","Cantidad por estado de conservación",null,null,"(5)\n\nCantidad de estudiantes que no tienen sillas","(1)\n\nCantidad total","Cantidad por estado de conservación",null,null,"Total","Buen estado","Regular estado","Mal estado","Total","Buen estado","Regular estado","Mal estado","Total","Buen estado","Regular estado","Mal estado","Total","Buen estado","Regular estado","Mal estado","Total","Buen estado","Regular estado","Mal estado","Total","Buen estado","Regular estado","Mal estado","Total","Buen estado","Regular estado","Mal estado","Total","Buen estado","Regular estado","Mal estado","Total","Buen estado","Regular estado","Mal estado","Total","Buen estado","Regular estado","Mal estado","Total","Buen estado","Regular estado","Mal estado"]
[null,null,"Corr","Uso","NivM","NivT","NivN","NM","TT","TN","SNU",{"$f":"IF('S400'!G33<>\"\",'S400'!G33,\"X\")","v":"X"},null,null,null,null,null,null,null,"(1)\nNivel","(2)\nEdad, Grado, Ciclo",null,null,null,null,null,"(3)\nSección","(4)\nNº de estudi- antes","(1)\nNivel","(2)\nEdad, Grado, Ciclo",null,null,null,null,null,"(3)\nSección","(4)\nNº de estudi- antes","(1)\nNivel","(2)\nEdad, Grado, Ciclo",null,null,null,null,null,"(3)\nSección","(4)\nNº de estudi- antes","Carrera 01","Carrera 02","Carrera 03","Carrera 04","Carrera 05","Carrera 06","Carrera 07","Carrera 08","Carrera 09","Carrera 10","Carrera 11","Carrera 12","Carrera 13","Carrera 14","Carrera 15","Carrera 16","Carrera 17","Carrera 18","Carrera 19","Carrera 20",null,null,null,null,null,null,null,null,null,null,null,null,null,null,null,null,null,null,null,null,null,null,null,null,null,"(2)\nEn buen estado","(3)\nRequieren mante- nimiento","(4)\nrequieren susti- tuirse",null,null,"(2)\nEn buen estado","(3)\nRequieren mante- nimiento","(4)\nrequieren susti- tuirse",null,"Cantidad\ntotal","Cantidad\ntotal",null,"(2)\nEn buen estado","(3)\nRequieren mante- nimiento","(4)\nrequieren susti- tuirse",null,null,"(2)\nEn buen estado","(3)\nRequieren mante- nimiento","(4)\nrequieren susti- tuirse"]
["TABLA 01 NIVEL Y MODALIDAD",null,1,{"$f":"IF(AND($N16<>\"\",$Q16<>\"\"),1,0)","v":0},{"$f":"IF(ISERROR(VLOOKUP($T16,$A$17:$B$33,2,FALSE)),\"\",VLOOKUP($T16,$A$17:$B$33,2,FALSE))","v":""},{"$f":"IF(ISERROR(VLOOKUP($AC16,$A$17:$B$33,2,FALSE)),\"\",VLOOKUP($AC16,$A$17:$B$33,2,FALSE))","v":""},{"$f":"IF(ISERROR(VLOOKUP($AL16,$A$17:$B$33,2,FALSE)),\"\",VLOOKUP($AL16,$A$17:$B$33,2,FALSE))","v":""},{"$f":"IF(OR(LEFT(T16,2)=\"K0\",LEFT(T16,2)=\"T0\",LEFT(T16,2)=\"M0\",LEFT(T16,2)=\"P0\",LEFT(T16,2)=\"S0\"),1,0)","v":0},{"$f":"IF(OR(LEFT(AC16,2)=\"K0\",LEFT(AC16,2)=\"T0\",LEFT(AC16,2)=\"M0\",LEFT(AC16,2)=\"P0\",LEFT(AC16,2)=\"S0\"),1,0)","v":0},{"$f":"IF(OR(LEFT(AL16,2)=\"K0\",LEFT(AL16,2)=\"T0\",LEFT(AL16,2)=\"M0\",LEFT(AL16,2)=\"P0\",LEFT(AL16,2)=\"S0\"),1,0)","v":0},{"$f":"IF(SUM(H16:J16)>0,\"X\",\"\")","v":""},{"$f":"IF('S400'!G34<>\"\",'S400'!G34,\"X\")","v":"X"},{"$f":"COUNTIF($AU16:$BN16,\"X\")","v":0},{"$f":"IF(C16<=$AC$9,C16,\"\")","v":1},"",1,"","","","","","","","","","","","","","","","","","","","","","","","","","","","","","","","","","","","","","","","","","","","","","","","","","","","","","","","","","","","","","","","","","","","","","","","","","","","","","","","","","","","","","","","","","","","","","","","","","","","","","","","","","","","","","","","","","","","","","","","","","","","","","","","","","","","","","","","","","",""]
["A1: INICIAL - Cuna ","AE_ines",2,0,"","","",{"$f":"IF(OR(LEFT(T17,2)=\"K0\",LEFT(T17,2)=\"T0\",LEFT(T17,2)=\"M0\",LEFT(T17,2)=\"P0\",LEFT(T17,2)=\"S0\"),1,0)","v":0},{"$f":"IF(OR(LEFT(AC17,2)=\"K0\",LEFT(AC17,2)=\"T0\",LEFT(AC17,2)=\"M0\",LEFT(AC17,2)=\"P0\",LEFT(AC17,2)=\"S0\"),1,0)","v":0},{"$f":"IF(OR(LEFT(AL17,2)=\"K0\",LEFT(AL17,2)=\"T0\",LEFT(AL17,2)=\"M0\",LEFT(AL17,2)=\"P0\",LEFT(AL17,2)=\"S0\"),1,0)","v":0},{"$f":"IF(SUM(H17:J17)>0,\"X\",\"\")","v":""},{"$f":"IF('S400'!G35<>\"\",'S400'!G35,\"X\")","v":"X"},{"$f":"COUNTIF($AU17:$BN17,\"X\")","v":0},""]
["A2: INICIAL - Jardín","A2_ini",3,0,"","","",{"$f":"IF(OR(LEFT(T18,2)=\"K0\",LEFT(T18,2)=\"T0\",LEFT(T18,2)=\"M0\",LEFT(T18,2)=\"P0\",LEFT(T18,2)=\"S0\"),1,0)","v":0},{"$f":"IF(OR(LEFT(AC18,2)=\"K0\",LEFT(AC18,2)=\"T0\",LEFT(AC18,2)=\"M0\",LEFT(AC18,2)=\"P0\",LEFT(AC18,2)=\"S0\"),1,0)","v":0},{"$f":"IF(OR(LEFT(AL18,2)=\"K0\",LEFT(AL18,2)=\"T0\",LEFT(AL18,2)=\"M0\",LEFT(AL18,2)=\"P0\",LEFT(AL18,2)=\"S0\"),1,0)","v":0},{"$f":"IF(SUM(H18:J18)>0,\"X\",\"\")","v":""},{"$f":"IF('S400'!G36<>\"\",'S400'!G36,\"X\")","v":"X"},0,""]
["A3: INICIAL - Cuna Jardín","AE_inoees",4,0,"","","",0,0,0,"",{"$f":"IF('S400'!G37<>\"\",'S400'!G37,\"X\")","v":"X"},0,""]
["A5: INICIAL No Escolarizado","AE_inoees",5,0,"","","",0,0,0,"",{"$f":"IF('S400'!G38<>\"\",'S400'!G38,\"X\")","v":"X"},0,""]
["B0: EBR-Primaria","BE_pres",6,0,"","","",0,0,0,"",{"$f":"IF('S400'!G39<>\"\",'S400'!G39,\"X\")","v":"X"},0,""]
["F0: EBR-Secundaria","F0_sec",7,0,"","","",0,0,0,"",{"$f":"IF('S400'!G40<>\"\",'S400'!G40,\"X\")","v":"X"},0,""]
["D1: EBA-Ini e Int","D1_eba",8,0,"","","",0,0,0,"",{"$f":"IF('S400'!G41<>\"\",'S400'!G41,\"X\")","v":"X"},0,""]
["D2: EBA-Avanzado","D2_eba",9,0,"","","",0,0,0,"",{"$f":"IF('S400'!G42<>\"\",'S400'!G42,\"X\")","v":"X"},0,""]
["E0: EBE-PRITE","AE_ines",10,0,"","","",0,0,0,"",{"$f":"IF('S400'!G43<>\"\",'S400'!G43,\"X\")","v":"X"},0,""]
["E1: EBE-Inicial","AE_inoees",11,0,"","","",0,0,0,"",{"$f":"IF('S400'!G44<>\"\",'S400'!G44,\"X\")","v":"X"},0,""]
["E2: EBE-Primaria","BE_pres",12,0,"","","",0,0,0,"",{"$f":"IF('S400'!G45<>\"\",'S400'!G45,\"X\")","v":"X"},0,""]
["K0: IESP","KPM_sup",13,0,"","","",0,0,0,"",{"$f":"IF('S400'!G46<>\"\",'S400'!G46,\"X\")","v":"X"},0,""]
["P0: EESP","KPM_sup",14,0,"","","",0,0,0,"",{"$f":"IF('S400'!G47<>\"\",'S400'!G47,\"X\")","v":"X"},0,""]
["T0: IEST","TS_sup",15,0,"","","",0,0,0,"",{"$f":"IF('S400'!G48<>\"\",'S400'!G48,\"X\")","v":"X"},0,""]
["S0: EEST","TS_sup",16,0,"","","",0,0,0,"",{"$f":"IF('S400'!G49<>\"\",'S400'!G49,\"X\")","v":"X"},0,""]
["M0: ESFA","KPM_sup",17,0,"","","",0,0,0,"",{"$f":"IF('S400'!G50<>\"\",'S400'!G50,\"X\")","v":"X"},0,""]
["L0: ETP-CETPRO","L0_etp",18,0,"","","",0,0,0,"",{"$f":"IF('S400'!G51<>\"\",'S400'!G51,\"X\")","v":"X"},0,""]
[null,null,19,0,"","","",0,0,0,"",{"$f":"IF('S400'!G52<>\"\",'S400'!G52,\"X\")","v":"X"},0,""]
["TABLA 02 - Puertas",null,20,0,"","","",0,0,0,"",{"$f":"IF('S400'!G53<>\"\",'S400'!G53,\"X\")","v":"X"},0,""]
["01: Madera",null,21,0,"","","",0,0,0,"",{"$f":"IF('S400'!G54<>\"\",'S400'!G54,\"X\")","v":"X"},0,""]
["02: Mallas metálicas",null,22,0,"","","",0,0,0,"",{"$f":"IF('S400'!G55<>\"\",'S400'!G55,\"X\")","v":"X"},0,""]
["03: Rejas metálicas",null,23,0,"","","",0,0,0,"",{"$f":"IF('S400'!G56<>\"\",'S400'!G56,\"X\")","v":"X"},0,""]
["04: Planchas metálicas",null,24,0,"","","",0,0,0,"",{"$f":"IF('S400'!G57<>\"\",'S400'!G57,\"X\")","v":"X"},0,""]
["05: Drywall",null,25,0,"","","",0,0,0,"",{"$f":"IF('S400'!G58<>\"\",'S400'!G58,\"X\")","v":"X"},0,""]
["06: Vidrio",null,26,0,"","","",0,0,0,"",{"$f":"IF('S400'!G59<>\"\",'S400'!G59,\"X\")","v":"X"},0,""]
["07: Otro",null,27,0,"","","",0,0,0,"",{"$f":"IF('S400'!G60<>\"\",'S400'!G60,\"X\")","v":"X"},0,""]
["08: NT pero lo requiere",null,28,0,"","","",0,0,0,"",{"$f":"IF('S400'!G61<>\"\",'S400'!G61,\"X\")","v":"X"},0,""]
["09: NT y no lo requiere",null,29,0,"","","",0,0,0,"",{"$f":"IF('S400'!G62<>\"\",'S400'!G62,\"X\")","v":"X"},0,""]
[null,null,30,0,"","","",0,0,0,"",{"$f":"IF('S400'!G63<>\"\",'S400'!G63,\"X\")","v":"X"},0,""]
["TABLA 03 - Ventanas",null,31,0,"","","",0,0,0,"",{"$f":"IF('S400'!G64<>\"\",'S400'!G64,\"X\")","v":"X"},0,""]
["01: De metal",null,32,0,"","","",0,0,0,"",{"$f":"IF('S400'!G65<>\"\",'S400'!G65,\"X\")","v":"X"},0,""]
["02: De madera",null,33,{"$f":"IF(AND($N48<>\"\",$Q48<>\"\"),1,0)","v":0},{"$f":"IF(ISERROR(VLOOKUP($T48,$A$17:$B$33,2,FALSE)),\"\",VLOOKUP($T48,$A$17:$B$33,2,FALSE))","v":""},{"$f":"IF(ISERROR(VLOOKUP($AC48,$A$17:$B$33,2,FALSE)),\"\",VLOOKUP($AC48,$A$17:$B$33,2,FALSE))","v":""},{"$f":"IF(ISERROR(VLOOKUP($AL48,$A$17:$B$33,2,FALSE)),\"\",VLOOKUP($AL48,$A$17:$B$33,2,FALSE))","v":""},0,0,0,"",{"$f":"IF('S400'!G66<>\"\",'S400'!G66,\"X\")","v":"X"},0,{"$f":"IF(C48<=$AC$9,C48,\"\")","v":""}]
["03: De PVC",null,34,0,"","","",0,0,0,"",{"$f":"IF('S400'!G67<>\"\",'S400'!G67,\"X\")","v":"X"},0,""]
["04: Mixta",null,35,0,"","","",0,0,0,"",{"$f":"IF('S400'!G68<>\"\",'S400'!G68,\"X\")","v":"X"},0,""]
["05: Otro",null,36,0,"","","",0,0,0,"",{"$f":"IF('S400'!G69<>\"\",'S400'!G69,\"X\")","v":"X"},0,""]
["06: NT pero lo requiere",null,37,0,"","","",0,0,0,"",{"$f":"IF('S400'!G70<>\"\",'S400'!G70,\"X\")","v":"X"},0,""]
["07: NT y no lo requiere",null,38,0,"","","",0,0,0,"",{"$f":"IF('S400'!G71<>\"\",'S400'!G71,\"X\")","v":"X"},0,""]
[null,null,39,0,"","","",0,0,0,"",{"$f":"IF('S400'!G72<>\"\",'S400'!G72,\"X\")","v":"X"},0,""]
["TABLA 04 - Paredes",null,40,0,"","","",0,0,0,"",{"$f":"IF('S400'!G73<>\"\",'S400'!G73,\"X\")","v":"X"},0,""]
["01: Ladrillo o concreto",null,41,0,"","","",0,0,0,"",{"$f":"IF('S400'!G74<>\"\",'S400'!G74,\"X\")","v":"X"},0,""]
["02: Adobe o tapial",null,42,0,"","","",0,0,0,"",{"$f":"IF('S400'!G75<>\"\",'S400'!G75,\"X\")","v":"X"},0,""]
["03: Quincha",null,43,0,"","","",0,0,0,"",{"$f":"IF('S400'!G76<>\"\",'S400'!G76,\"X\")","v":"X"},0,""]
["04: Piedra con barro cal o cemento",null,44,0,"","","",0,0,0,"",{"$f":"IF('S400'!G77<>\"\",'S400'!G77,\"X\")","v":"X"},0,""]
["05: Madera",null,45,0,"","","",0,0,0,"",{"$f":"IF('S400'!G78<>\"\",'S400'!G78,\"X\")","v":"X"},0,""]
["06: Triplay",null,46,0,"","","",0,0,0,"",{"$f":"IF('S400'!G79<>\"\",'S400'!G79,\"X\")","v":"X"},0,""]
["07: Eternit o fibra de concreto",null,47,0,"","","",0,0,0,"",{"$f":"IF('S400'!G80<>\"\",'S400'!G80,\"X\")","v":"X"},0,""]
["08: Estera, cartón o plástico",null,48,0,"","","",0,0,0,"",{"$f":"IF('S400'!G81<>\"\",'S400'!G81,\"X\")","v":"X"},0,""]
["09: Otro",null,49,0,"","","",0,0,0,"",{"$f":"IF('S400'!G82<>\"\",'S400'!G82,\"X\")","v":"X"},0,""]
[null,null,50,0,"","","",0,0,0,"",{"$f":"IF('S400'!G83<>\"\",'S400'!G83,\"X\")","v":"X"},0,""]
["TABLA 05 - Techo",null,51,0,"","","",0,0,0,"",{"$f":"IF('S400'!G84<>\"\",'S400'!G84,\"X\")","v":"X"},0,""]
["01: Concreto armado",null,52,0,"","","",0,0,0,"",{"$f":"IF('S400'!G85<>\"\",'S400'!G85,\"X\")","v":"X"},0,""]
["02: Madera",null,53,0,"","","",0,0,0,"",{"$f":"IF('S400'!G86<>\"\",'S400'!G86,\"X\")","v":"X"},0,""]
["03: Teja",null,54,0,"","","",0,0,0,"",{"$f":"IF('S400'!G87<>\"\",'S400'!G87,\"X\")","v":"X"},0,""]
["04: Fibra de cemento",null,55,0,"","","",0,0,0,"",{"$f":"IF('S400'!G88<>\"\",'S400'!G88,\"X\")","v":"X"},0,""]
["05: Calamina",null,56,0,"","","",0,0,0,"",{"$f":"IF('S400'!G89<>\"\",'S400'!G89,\"X\")","v":"X"},0,""]
["06: Calaminon",null,57,0,"","","",0,0,0,"",{"$f":"IF('S400'!G90<>\"\",'S400'!G90,\"X\")","v":"X"},0,""]
["07: Eternit",null,58,0,"","","",0,0,0,"",{"$f":"IF('S400'!G91<>\"\",'S400'!G91,\"X\")","v":"X"},0,""]
["08: Caña con barro",null,59,0,"","","",0,0,0,"",{"$f":"IF('S400'!G92<>\"\",'S400'!G92,\"X\")","v":"X"},0,""]
["09: Lata o latón",null,60,0,"","","",0,0,0,"",{"$f":"IF('S400'!G93<>\"\",'S400'!G93,\"X\")","v":"X"},0,""]
["10: Otro",null,61,0,"","","",0,0,0,"",{"$f":"IF('S400'!G94<>\"\",'S400'!G94,\"X\")","v":"X"},0,""]
[null,null,62,0,"","","",0,0,0,"",{"$f":"IF('S400'!G95<>\"\",'S400'!G95,\"X\")","v":"X"},0,""]
["TABLA 06 - Piso",null,63,0,"","","",0,0,0,"",{"$f":"IF('S400'!G96<>\"\",'S400'!G96,\"X\")","v":"X"},0,""]
["01: Parquet o madera pulida",null,64,0,"","","",0,0,0,"",{"$f":"IF('S400'!G97<>\"\",'S400'!G97,\"X\")","v":"X"},0,""]
["02: Vinilico, pisopak o similar",null,65,{"$f":"IF(AND($N80<>\"\",$Q80<>\"\"),1,0)","v":0},{"$f":"IF(ISERROR(VLOOKUP($T80,$A$17:$B$33,2,FALSE)),\"\",VLOOKUP($T80,$A$17:$B$33,2,FALSE))","v":""},{"$f":"IF(ISERROR(VLOOKUP($AC80,$A$17:$B$33,2,FALSE)),\"\",VLOOKUP($AC80,$A$17:$B$33,2,FALSE))","v":""},{"$f":"IF(ISERROR(VLOOKUP($AL80,$A$17:$B$33,2,FALSE)),\"\",VLOOKUP($AL80,$A$17:$B$33,2,FALSE))","v":""},0,0,0,"",{"$f":"IF('S400'!G98<>\"\",'S400'!G98,\"X\")","v":"X"},0,{"$f":"IF(C80<=$AC$9,C80,\"\")","v":""}]
["03: Loseta, cerámico o similar",null,66,0,"","","",0,0,0,"",{"$f":"IF('S400'!G99<>\"\",'S400'!G99,\"X\")","v":"X"},{"$f":"COUNTIF($AU81:$BN81,\"X\")","v":0},""]
["04: Cemento",null,67,0,"","","",{"$f":"IF(OR(LEFT(T82,2)=\"K0\",LEFT(T82,2)=\"T0\",LEFT(T82,2)=\"M0\",LEFT(T82,2)=\"P0\",LEFT(T82,2)=\"S0\"),1,0)","v":0},{"$f":"IF(OR(LEFT(AC82,2)=\"K0\",LEFT(AC82,2)=\"T0\",LEFT(AC82,2)=\"M0\",LEFT(AC82,2)=\"P0\",LEFT(AC82,2)=\"S0\"),1,0)","v":0},{"$f":"IF(OR(LEFT(AL82,2)=\"K0\",LEFT(AL82,2)=\"T0\",LEFT(AL82,2)=\"M0\",LEFT(AL82,2)=\"P0\",LEFT(AL82,2)=\"S0\"),1,0)","v":0},{"$f":"IF(SUM(H82:J82)>0,\"X\",\"\")","v":""},{"$f":"IF('S400'!G100<>\"\",'S400'!G100,\"X\")","v":"X"},0,""]
["05: Madera (entablado)",null,68,0,"","","",0,0,0,"",{"$f":"IF('S400'!G101<>\"\",'S400'!G101,\"X\")","v":"X"},0,""]
["06: Tierra",null,69,0,"","","",0,0,0,"",{"$f":"IF('S400'!G102<>\"\",'S400'!G102,\"X\")","v":"X"},0,""]
["07: Otro",null,70,0,"","","",0,0,0,"",{"$f":"IF('S400'!G103<>\"\",'S400'!G103,\"X\")","v":"X"},0,""]
[null,null,71,0,"","","",0,0,0,"",{"$f":"IF('S400'!G104<>\"\",'S400'!G104,\"X\")","v":"X"},0,""]
["TABLA 07 - Estado",null,72,0,"","","",0,0,0,"",{"$f":"IF('S400'!G105<>\"\",'S400'!G105,\"X\")","v":"X"},0,""]
["01: Bueno",null,73,0,"","","",0,0,0,"",{"$f":"IF('S400'!G106<>\"\",'S400'!G106,\"X\")","v":"X"},0,""]
["02: Regular",null,74,0,"","","",0,0,0,"",{"$f":"IF('S400'!G107<>\"\",'S400'!G107,\"X\")","v":"X"},0,""]
["03: Malo",null,75,0,"","","",0,0,0,"",{"$f":"IF('S400'!G108<>\"\",'S400'!G108,\"X\")","v":"X"},0,""]
["04: No aplica",null,76,0,"","","",0,0,0,"",{"$f":"IF('S400'!G109<>\"\",'S400'!G109,\"X\")","v":"X"},0,""]
[null,null,77,0,"","","",0,0,0,"",{"$f":"IF('S400'!G110<>\"\",'S400'!G110,\"X\")","v":"X"},0,""]
["Tabla : Si, No",null,78,0,"","","",0,0,0,"",{"$f":"IF('S400'!G111<>\"\",'S400'!G111,\"X\")","v":"X"},0,""]
["SI",null,79,0,"","","",0,0,0,"",{"$f":"IF('S400'!G112<>\"\",'S400'!G112,\"X\")","v":"X"},0,""]
["NO",null,80,0,"","","",0,0,0,"",{"$f":"IF('S400'!G113<>\"\",'S400'!G113,\"X\")","v":"X"},0,""]
["NA",null,81,0,"","","",0,0,0,"",{"$f":"IF('S400'!G114<>\"\",'S400'!G114,\"X\")","v":"X"},0,""]
["Tabla : ",null,82,0,"","","",0,0,0,"",{"$f":"IF('S400'!G115<>\"\",'S400'!G115,\"X\")","v":"X"},0,""]
["01: Regular",null,83,0,"","","",0,0,0,"",{"$f":"IF('S400'!G116<>\"\",'S400'!G116,\"X\")","v":"X"},0,""]
["02: Funcional",null,84,0,"","","",0,0,0,"",null,0,""]
[null,null,85,0,"","","",0,0,0,"",null,0,""]
["Tabla : Secciones",null,86,0,"","","",0,0,0,"",null,0,""]
["A",null,87,0,"","","",0,0,0,"",null,0,""]
["B",null,88,0,"","","",0,0,0,"",null,0,""]
["C",null,89,0,"","","",0,0,0,"",null,0,""]
["D",null,90,0,"","","",0,0,0,"",null,0,""]
["E",null,91,0,"","","",0,0,0,"",null,0,""]
["F",null,92,0,"","","",0,0,0,"",null,0,""]
["G",null,93,0,"","","",0,0,0,"",null,0,""]
["H",null,94,0,"","","",0,0,0,"",null,0,""]
["I",null,95,0,"","","",0,0,0,"",null,0,""]
["J",null,96,0,"","","",0,0,0,"",null,0,""]
["K",null,97,{"$f":"IF(AND($N112<>\"\",$Q112<>\"\"),1,0)","v":0},{"$f":"IF(ISERROR(VLOOKUP($T112,$A$17:$B$33,2,FALSE)),\"\",VLOOKUP($T112,$A$17:$B$33,2,FALSE))","v":""},{"$f":"IF(ISERROR(VLOOKUP($AC112,$A$17:$B$33,2,FALSE)),\"\",VLOOKUP($AC112,$A$17:$B$33,2,FALSE))","v":""},{"$f":"IF(ISERROR(VLOOKUP($AL112,$A$17:$B$33,2,FALSE)),\"\",VLOOKUP($AL112,$A$17:$B$33,2,FALSE))","v":""},0,0,0,"",null,0,{"$f":"IF(C112<=$AC$9,C112,\"\")","v":""}]
["L",null,98,0,"","","",0,0,0,"",null,0,""]
["M",null,99,0,"","","",0,0,0,"",null,0,""]
["N",null,100,0,"","","",0,0,0,"",null,0,""]
["O",null,101,0,"","","",0,0,0,"",null,0,""]
["P",null,102,0,"","","",0,0,0,"",null,0,""]
["Q",null,103,0,"","","",0,0,0,"",null,0,""]
["R",null,104,0,"","","",0,0,0,"",null,0,""]
["S",null,105,0,"","","",0,0,0,"",null,0,""]
["T",null,106,0,"","","",0,0,0,"",null,0,""]
["U",null,107,0,"","","",0,0,0,"",null,0,""]
["V",null,108,0,"","","",0,0,0,"",null,0,""]
["W",null,109,0,"","","",0,0,0,"",null,0,""]
["X",null,110,0,"","","",0,0,0,"",null,0,""]
["Y",null,111,0,"","","",0,0,0,"",null,0,""]
["Z",null,112,0,"","","",0,0,0,"",null,0,""]
["No-aplica",null,113,0,"","","",0,0,0,"",null,0,""]
[null,null,114,0,"","","",0,0,0,"",null,0,""]
[null,null,115,0,"","","",0,0,0,"",null,0,""]
[null,null,116,0,"","","",0,0,0,"",null,0,""]
[null,null,117,0,"","","",0,0,0,"",null,0,""]
[null,null,118,0,"","","",0,0,0,"",null,0,""]
[null,null,119,0,"","","",0,0,0,"",null,0,""]
[null,null,120,0,"","","",0,0,0,"",null,0,""]
[null,null,121,0,"","","",0,0,0,"",null,0,""]
[null,null,122,0,"","","",0,0,0,"",null,0,""]
[null,null,123,0,"","","",0,0,0,"",null,0,""]
[null,null,124,0,"","","",0,0,0,"",null,0,""]
[null,null,125,0,"","","",0,0,0,"",null,0,""]
[null,null,126,0,"","","",0,0,0,"",null,0,""]
[null,null,127,0,"","","",0,0,0,"",null,0,""]
[null,null,128,0,"","","",0,0,0,"",null,0,""]
[null,null,129,{"$f":"IF(AND($N144<>\"\",$Q144<>\"\"),1,0)","v":0},{"$f":"IF(ISERROR(VLOOKUP($T144,$A$17:$B$33,2,FALSE)),\"\",VLOOKUP($T144,$A$17:$B$33,2,FALSE))","v":""},{"$f":"IF(ISERROR(VLOOKUP($AC144,$A$17:$B$33,2,FALSE)),\"\",VLOOKUP($AC144,$A$17:$B$33,2,FALSE))","v":""},{"$f":"IF(ISERROR(VLOOKUP($AL144,$A$17:$B$33,2,FALSE)),\"\",VLOOKUP($AL144,$A$17:$B$33,2,FALSE))","v":""},0,0,0,"",null,0,{"$f":"IF(C144<=$AC$9,C144,\"\")","v":""}]
[null,null,130,0,"","","",0,0,0,"",null,{"$f":"COUNTIF($AU145:$BN145,\"X\")","v":0},""]
[null,null,131,0,"","","",{"$f":"IF(OR(LEFT(T146,2)=\"K0\",LEFT(T146,2)=\"T0\",LEFT(T146,2)=\"M0\",LEFT(T146,2)=\"P0\",LEFT(T146,2)=\"S0\"),1,0)","v":0},{"$f":"IF(OR(LEFT(AC146,2)=\"K0\",LEFT(AC146,2)=\"T0\",LEFT(AC146,2)=\"M0\",LEFT(AC146,2)=\"P0\",LEFT(AC146,2)=\"S0\"),1,0)","v":0},{"$f":"IF(OR(LEFT(AL146,2)=\"K0\",LEFT(AL146,2)=\"T0\",LEFT(AL146,2)=\"M0\",LEFT(AL146,2)=\"P0\",LEFT(AL146,2)=\"S0\"),1,0)","v":0},{"$f":"IF(SUM(H146:J146)>0,\"X\",\"\")","v":""},null,0,""]
[null,null,132,0,"","","",0,0,0,"",null,0,""]
[null,null,133,0,"","","",0,0,0,"",null,0,""]
[null,null,134,0,"","","",0,0,0,"",null,0,""]
[null,null,135,0,"","","",0,0,0,"",null,0,""]
[null,null,136,0,"","","",0,0,0,"",null,0,""]
[null,null,137,0,"","","",0,0,0,"",null,0,""]
[null,null,138,0,"","","",0,0,0,"",null,0,""]
[null,null,139,0,"","","",0,0,0,"",null,0,""]
[null,null,140,0,"","","",0,0,0,"",null,0,""]
[null,null,141,0,"","","",0,0,0,"",null,0,""]
[null,null,142,0,"","","",0,0,0,"",null,0,""]
[null,null,143,0,"","","",0,0,0,"",null,0,""]
[null,null,144,0,"","","",0,0,0,"",null,0,""]
[null,null,145,0,"","","",0,0,0,"",null,0,""]
[null,null,146,0,"","","",0,0,0,"",null,0,""]
[null,null,147,0,"","","",0,0,0,"",null,0,""]
[null,null,148,0,"","","",0,0,0,"",null,0,""]
[null,null,149,0,"","","",0,0,0,"",null,0,""]
[null,null,150,0,"","","",0,0,0,"",null,0,""]
[null,null,151,0,"","","",0,0,0,"",null,0,""]
[null,null,152,0,"","","",0,0,0,"",null,0,""]
[null,null,153,0,"","","",0,0,0,"",null,0,""]
[null,null,154,0,"","","",0,0,0,"",null,0,""]
[null,null,155,0,"","","",0,0,0,"",null,0,""]
[null,null,156,0,"","","",0,0,0,"",null,0,""]
[null,null,157,0,"","","",0,0,0,"",null,0,""]
[null,null,158,0,"","","",0,0,0,"",null,0,""]
[null,null,159,0,"","","",0,0,0,"",null,0,""]
[null,null,160,0,"","","",0,0,0,"",null,0,""]
[null,null,161,{"$f":"IF(AND($N176<>\"\",$Q176<>\"\"),1,0)","v":0},{"$f":"IF(ISERROR(VLOOKUP($T176,$A$17:$B$33,2,FALSE)),\"\",VLOOKUP($T176,$A$17:$B$33,2,FALSE))","v":""},{"$f":"IF(ISERROR(VLOOKUP($AC176,$A$17:$B$33,2,FALSE)),\"\",VLOOKUP($AC176,$A$17:$B$33,2,FALSE))","v":""},{"$f":"IF(ISERROR(VLOOKUP($AL176,$A$17:$B$33,2,FALSE)),\"\",VLOOKUP($AL176,$A$17:$B$33,2,FALSE))","v":""},0,0,0,"",null,0,{"$f":"IF(C176<=$AC$9,C176,\"\")","v":""}]
[null,null,162,0,"","","",0,0,0,"",null,0,""]
[null,null,163,0,"","","",0,0,0,"",null,0,""]
[null,null,164,0,"","","",0,0,0,"",null,0,""]
[null,null,165,0,"","","",0,0,0,"",null,0,""]
[null,null,166,0,"","","",0,0,0,"",null,0,""]
[null,null,167,0,"","","",0,0,0,"",null,0,""]
[null,null,168,0,"","","",0,0,0,"",null,0,""]
[null,null,169,0,"","","",0,0,0,"",null,0,""]
[null,null,170,0,"","","",0,0,0,"",null,0,""]
[null,null,171,0,"","","",0,0,0,"",null,0,""]
[null,null,172,0,"","","",0,0,0,"",null,0,""]
[null,null,173,0,"","","",0,0,0,"",null,0,""]
[null,null,174,0,"","","",0,0,0,"",null,0,""]
[null,null,175,0,"","","",0,0,0,"",null,0,""]
[null,null,176,0,"","","",0,0,0,"",null,0,""]
[null,null,177,0,"","","",0,0,0,"",null,0,""]
[null,null,178,0,"","","",0,0,0,"",null,0,""]
[null,null,179,0,"","","",0,0,0,"",null,0,""]
[null,null,180,0,"","","",0,0,0,"",null,0,""]
[null,null,181,0,"","","",0,0,0,"",null,0,""]
[null,null,182,0,"","","",0,0,0,"",null,0,""]
[null,null,183,0,"","","",0,0,0,"",null,0,""]
[null,null,184,0,"","","",0,0,0,"",null,0,""]
[null,null,185,0,"","","",0,0,0,"",null,0,""]
[null,null,186,0,"","","",0,0,0,"",null,0,""]
[null,null,187,0,"","","",0,0,0,"",null,0,""]
[null,null,188,0,"","","",0,0,0,"",null,0,""]
[null,null,189,0,"","","",0,0,0,"",null,0,""]
[null,null,190,0,"","","",0,0,0,"",null,0,""]
[null,null,191,0,"","","",0,0,0,"",null,0,""]
[null,null,192,0,"","","",0,0,0,"",null,0,""]
[null,null,193,{"$f":"IF(AND($N208<>\"\",$Q208<>\"\"),1,0)","v":0},{"$f":"IF(ISERROR(VLOOKUP($T208,$A$17:$B$33,2,FALSE)),\"\",VLOOKUP($T208,$A$17:$B$33,2,FALSE))","v":""},{"$f":"IF(ISERROR(VLOOKUP($AC208,$A$17:$B$33,2,FALSE)),\"\",VLOOKUP($AC208,$A$17:$B$33,2,FALSE))","v":""},{"$f":"IF(ISERROR(VLOOKUP($AL208,$A$17:$B$33,2,FALSE)),\"\",VLOOKUP($AL208,$A$17:$B$33,2,FALSE))","v":""},0,0,0,"",null,0,{"$f":"IF(C208<=$AC$9,C208,\"\")","v":""}]
[null,null,194,0,"","","",0,0,0,"",null,{"$f":"COUNTIF($AU209:$BN209,\"X\")","v":0},""]
[null,null,195,0,"","","",{"$f":"IF(OR(LEFT(T210,2)=\"K0\",LEFT(T210,2)=\"T0\",LEFT(T210,2)=\"M0\",LEFT(T210,2)=\"P0\",LEFT(T210,2)=\"S0\"),1,0)","v":0},{"$f":"IF(OR(LEFT(AC210,2)=\"K0\",LEFT(AC210,2)=\"T0\",LEFT(AC210,2)=\"M0\",LEFT(AC210,2)=\"P0\",LEFT(AC210,2)=\"S0\"),1,0)","v":0},{"$f":"IF(OR(LEFT(AL210,2)=\"K0\",LEFT(AL210,2)=\"T0\",LEFT(AL210,2)=\"M0\",LEFT(AL210,2)=\"P0\",LEFT(AL210,2)=\"S0\"),1,0)","v":0},{"$f":"IF(SUM(H210:J210)>0,\"X\",\"\")","v":""},null,0,""]
[null,null,196,0,"","","",0,0,0,"",null,0,""]
[null,null,197,0,"","","",0,0,0,"",null,0,""]
[null,null,198,0,"","","",0,0,0,"",null,0,""]
[null,null,199,0,"","","",0,0,0,"",null,0,""]
[null,null,200,0,"","","",0,0,0,"",null,0,""]
[null,null,201,null,null,null,null,0,0,0,"",null,null,"Limite","Limite","Limite","Limite","Limite","Limite","Limite","Limite","Limite","Limite","Limite","Limite","Limite","Limite","Limite","Limite","Limite","Limite","Limite","Limite","Limite","Limite","Limite","Limite","Limite","Limite","Limite","Limite","Limite","Limite","Limite","Limite","Limite","Limite","Limite","Limite","Limite","Limite","Limite","Limite","Limite","Limite","Limite","Limite","Limite","Limite","Limite","Limite","Limite","Limite","Limite","Limite","Limite","Limite","Limite","Limite","Limite","Limite","Limite","Limite","Limite","Limite","Limite","Limite","Limite","Limite","Limite","Limite","Limite","Limite","Limite","Limite","Limite","Limite","Limite","Limite","Limite","Limite","Limite","Limite","Limite","Limite","Limite","Limite","Limite","Limite","Limite","Limite","Limite","Limite","Limite","Limite","Limite","Limite","Limite","Limite","Limite","Limite","Limite","Limite","Limite","Limite","Limite","Limite","Limite","Limite","Limite","Limite","Limite","Limite","Limite","Limite","Limite","Limite","Limite","Limite","Limite","Limite","Limite","Limite","Limite","Limite","Limite","Limite","Limite","Limite","Limite","Limite","Limite","Limite","Limite","Limite","Limite","Limite","Limite","Limite","Limite","Limite","Limite","Limite","Limite","Limite"]
[]
[]
[]
[]
[]
[]
[]
[]
[]
[]
[]
[]
[]
[]
[]
[]
[]
[]
[]
[]
[]
[]
[]
[]
[]
[]
[]
[]
[]
[]
[]
[]
[]
[]
[]
[]
[]
[]
[]
[]
[]
[]
[]
[]
[]
[]
[]
[]
[]
[]
[]
[]
[]
[]
[]
[]
[]
[]
[]
[]
[]
[]
[]
[]
[]
[]
[]
[]
[]
[]
[]
[]
[]
[]
[]
[]
[]
[]
[]
[]
[]
[]
[]
[]
[null,"A1_ini","E0_ebe","A2_ini","A3_ini","A5_ini","E1_ebe"]
[null,0,0,3,0,0,0]
[null,1,1,4,1,1,1]
[null,2,2,5,2,2,2]
[null,null,null,null,3,3,3]
[null,null,null,null,4,4,4]
[null,null,null,null,5,5,5]
[]
[null,"B0_pri","E2_ebe","F0_sec","D1_eba","D2_eba","L0_etp"]
[null,1,1,1,"IN1",1,"AXT"]
[null,2,2,2,"IN2",2,"TEC"]
[null,3,3,3,"IT1",3]
[null,4,4,4,"IT2",4]
[null,5,5,5,"IT3"]
[null,6,6]
[]
[]
[null,null,null,null,"K0_iesp","M0_esfa","T0_iest"]
[null,null,null,null,"I","I","I"]
[null,null,null,null,"II","II","II"]
[null,null,null,null,"III","III","III"]
[null,null,null,null,"IV","IV","IV"]
[null,null,null,null,"V","V","V"]
[null,null,null,null,"VI","VI","VI"]
[null,null,null,null,"VII","VII","VII"]
[null,null,null,null,"VIII","VIII","VIII"]
[null,null,null,null,"IX","IX"]
[null,null,null,null,"X","X"]

{"sheet":"S600","index":8,"n_rows":216,"n_cols":119,"rows_kept":216,"cut":false,"hidden":false,"merged":[[14,72,14,74],[12,71,13,74],[14,71,15,71],[13,108,14,110],[12,76,12,118],[13,96,13,98],[13,116,13,118],[13,100,14,102],[14,80,14,82],[14,84,14,86],[14,92,14,94],[13,80,13,82],[13,84,13,86],[13,88,13,90],[13,92,13,94],[14,88,14,90],[14,48,15,48],[14,49,15,49],[12,13,13,46],[14,8,15,8],[14,9,15,9],[13,11,15,11],[13,48,13,49],[13,12,15,12],[14,13,14,21],[13,47,15,47],[14,70,15,70],[14,58,15,58],[14,54,15,54],[13,50,15,50],[13,51,13,53],[14,51,15,51],[13,56,13,60],[14,60,15,60],[14,57,15,57],[14,59,15,59],[14,55,15,55],[14,56,15,56],[13,54,13,55],[14,53,15,53],[14,52,15,52],[13,112,14,114],[13,61,13,62],[14,67,15,67],[14,68,15,68],[14,96,14,98],[13,104,14,106],[14,69,15,69],[14,76,14,78],[14,63,15,63],[14,64,15,64],[14,65,15,65],[14,66,15,66],[14,61,15,61],[14,62,15,62],[13,63,13,64],[13,65,13,66],[13,76,13,78],[1,10,1,41],[2,10,2,41],[12,61,12,62],[12,63,12,64],[12,65,12,66],[12,48,12,49],[12,51,12,53],[12,56,12,60],[12,54,12,55]]}
[null,null,null,null,null,{"$f":"IF('S400'!G19<>\"\",'S400'!G19,\"X\")","v":"X"}]
[null,null,null,null,null,{"$f":"IF('S400'!G20<>\"\",'S400'!G20,\"X\")","v":"X"},null,null,null,null,"CENSO EDUCATIVO 2024"]
[null,null,null,null,null,{"$f":"IF('S400'!G21<>\"\",'S400'!G21,\"X\")","v":"X"},null,null,null,null,"LOCAL EDUCATIVO"]
[null,null,null,null,null,{"$f":"IF('S400'!G22<>\"\",'S400'!G22,\"X\")","v":"X"}]
[null,null,null,null,null,{"$f":"IF('S400'!G23<>\"\",'S400'!G23,\"X\")","v":"X"}]
[null,null,null,null,null,{"$f":"IF('S400'!G24<>\"\",'S400'!G24,\"X\")","v":"X"}]
[null,null,null,null,null,{"$f":"IF('S400'!G25<>\"\",'S400'!G25,\"X\")","v":"X"},null,"600. CARACTERÍSTICAS DE OTROS ESPACIOS EDUCATIVOS Y DE SOPORTE DISTINTOS AL AULA EN EL LOCAL EDUCATIVO [Solo para la gestión Pública]"]
[null,null,null,null,null,{"$f":"IF('S400'!G26<>\"\",'S400'!G26,\"X\")","v":"X"}]
[null,null,null,null,null,{"$f":"IF('S400'!G27<>\"\",'S400'!G27,\"X\")","v":"X"}]
[null,null,null,null,null,{"$f":"IF('S400'!G28<>\"\",'S400'!G28,\"X\")","v":"X"},null,null,null,"(Considere a los espacios EN USO y SIN USO)",null,null,"601. CANTIDAD DE OTROS ESPACIOS EDUCATIVOS Y DE SOPORTE DISTINTOS AL AULA :"]
[null,null,null,null,null,{"$f":"IF('S400'!G29<>\"\",'S400'!G29,\"X\")","v":"X"}]
[null,null,null,null,null,{"$f":"IF('S400'!G30<>\"\",'S400'!G30,\"X\")","v":"X"}]
[null,null,null,null,null,{"$f":"IF('S400'!G31<>\"\",'S400'!G31,\"X\")","v":"X"},null,null,"(1)","(2)","(3)","(4)","(5)","(6)\nNiveles educativos de la Educación Básica/ETP y/o Carreras/Programas de la Educación Superior que usan el ambiente\nMarque con una “X” los niveles y/o carreras/Programas de Educación Superior que utiliza el ambiente",null,null,null,null,null,null,null,null,null,null,null,null,null,null,null,null,null,null,null,null,null,null,null,null,null,null,null,null,null,null,null,null,null,"(7)","(8)",null,"(9)","(10)",null,null,"(11)",null,"(12)",null,null,null,null,"(13)",null,"(14)",null,"(15)",null,"(16)","(17)","(18)","(19)","(20)\nPizarras",null,null,null,null,"(21) Cantidad, tenencia y estado de conservación del mobiliario en uso en los otros ambientes"]
[null,null,null,null,null,{"$f":"IF('S400'!G32<>\"\",'S400'!G32,\"X\")","v":"X"},null,null,null,null,null,"El ambiente ¿Se encuentra en uso?","El ambiente según código de espacio ¿ha sido construido para:?",null,null,null,null,null,null,null,null,null,null,null,null,null,null,null,null,null,null,null,null,null,null,null,null,null,null,null,null,null,null,null,null,null,null,"¿Tiene\nforma\nde\ncuadri- látero?","Dimensiones de ambientes",null,"¿Cuenta con señaliza- ción de seguridad?","Puertas",null,null,"Cerraduras",null,"Ventanas",null,null,null,null,"Paredes",null,"Techo",null,"Piso",null,null,null,null,null,null,null,null,null,null,"(1)",null,null,null,"(2)",null,null,null,"(3)",null,null,null,"(4)",null,null,null,"(5)",null,null,null,"(6)",null,null,null,"(7)\nMueble de Kitchenette",null,null,null,"(8)\nVitrinas y camillas para tópico",null,null,null,"(9)\nCasa Psicomotricidad",null,null,null,"(10)\nDispositivo para trepar o saltar",null,null,null,"(11)"]
[null,null,null,null,null,{"$f":"IF('S400'!G33<>\"\",'S400'!G33,\"X\")","v":"X"},null,"Nº","Nº de edifica- ción","Nº de piso","Detalle del espacio",null,null,"Niveles de la Educación Básica y ETP",null,null,null,null,null,null,null,null,null,null,null,null,null,"Carreras/Programas de la Educación Superior que usan el ambiente",null,null,null,null,null,null,null,null,null,null,null,null,null,null,null,null,null,null,null,null,"(1)\n\nLargo\n(ml)","(2)\n\nAncho\n (ml)",null,"(1)\n\nCantidad","(2)\n\nMaterial\npredominante","(3)\n\nEstado de conserva-\nción","(1)\n\nCantidad","(2)\nEstado de conserva-\nción","(1)\n\nCantidad","(2)\nMaterial predominante del marco de la ventana","(3)\nEstado de Conservación del marco de la ventana","(4)\n\n¿Favorecen\nla ventilación\ndel ambiente?","(5)\n\nEstado de Conservación\nde los vidrios","(1)\nMaterial\npredominante","(2)\nEstado de conserva-\nción","(1)\nMaterial\npredominante","(2)\nEstado de conserva-\nción","(1)\nMaterial\npredominante","(2)\nEstado de conserva-\nción","¿Cuenta con instalaciones eléctricas?","¿Cuenta con instalaciones sanitarias?","¿Cuenta con conexión a internet?","¿Cuenta con\ninstalación\nde gas?","(1)\n\nCantidad\nTotal","Cantidad por Estado de conservación",null,null,null,"Escritorios",null,null,null,"Sillas",null,null,null,"Armarios",null,null,null,"Estantes",null,null,null,"Lockers",null,null,null,"Exhibidores",null,null,null,null,null,null,null,null,null,null,null,null,null,null,null,null,null,null,null,"Otros muebles"]
["TABLA 01 - Detalle del espacio","Dpx","Corr","NivB","NivS",{"$f":"IF('S400'!G34<>\"\",'S400'!G34,\"X\")","v":"X"},null,null,null,null,null,null,null,"A..","B0","F0","D1","D2","E0","E1","E2","L0","K0","T0","M0","P0","S0","Carrera 01","Carrera 02","Carrera 03","Carrera 04","Carrera 05","Carrera 06","Carrera 07","Carrera 08","Carrera 09","Carrera 10","Carrera 11","Carrera 12","Carrera 13","Carrera 14","Carrera 15","Carrera 16","Carrera 17","Carrera 18","Carrera 19","Carrera 20",null,null,null,null,null,null,null,null,null,null,null,null,null,null,null,null,null,null,null,null,null,null,null,null,null,"(2)\nEn buen estado","(3)\nRequieren mante- nimiento","(4)\nrequieren susti-tuirse","Total","Bueno","Regular","Malo","Total","Bueno","Regular","Malo","Total","Bueno","Regular","Malo","Total","Bueno","Regular","Malo","Total","Bueno","Regular","Malo","Total","Bueno","Regular","Malo","Total","Bueno","Regular","Malo","Total","Bueno","Regular","Malo","Total","Bueno","Regular","Malo","Total","Bueno","Regular","Malo","Total","Bueno","Regular","Malo"]
["001: SALA O AULA DE PSICOMOTRICIDAD (INI ...",null,1,{"$f":"IF(AND(COUNTIF(N17:V17,\"X\")>0,COUNTIF(W17:AA17,\"X\")=0),1,IF(AND(COUNTIF(N17:V17,\"X\")=0,COUNTIF(W17:AA17,\"X\")>0),2,IF(AND(COUNTIF(N17:V17,\"X\")>0,COUNTIF(W17:AA17,\"X\")>0),3,0)))","v":0},{"$f":"IF(OR(D17=2,D17=3),\"X\",\"\")","v":""},{"$f":"IF('S400'!G35<>\"\",'S400'!G35,\"X\")","v":"X"},null,{"$f":"IF($C17<=$L$10,C17,\"\")","v":""},"","","","","","","","","","","","","","","","","","","","","","","","","","","","","","","","","","","","","","","","","","","","","","","","","","","","","","","","","","","","","","","","","","","","","","","","","","","","","","","","","","","","","","","","","","","","","","","","","","","","","","","","","","","","","","",""]
["002: AULA VIVENCIAL (CEBE)",null,2,{"$f":"IF(AND(COUNTIF(N18:V18,\"X\")>0,COUNTIF(W18:AA18,\"X\")=0),1,IF(AND(COUNTIF(N18:V18,\"X\")=0,COUNTIF(W18:AA18,\"X\")>0),2,IF(AND(COUNTIF(N18:V18,\"X\")>0,COUNTIF(W18:AA18,\"X\")>0),3,0)))","v":0},{"$f":"IF(OR(D18=2,D18=3),\"X\",\"\")","v":""},{"$f":"IF('S400'!G36<>\"\",'S400'!G36,\"X\")","v":"X"},null,"","","","","","","","","","","","","","","","","","","","","","","","","","","","","","","","","","","","","","","","","","","","","","","","","","","","","","","","","","","","","","","","","","","","","","","","","","","","","","","","","","","","","","","","","","","","","","","","","","","","","","","","","","","","","","","",""]
["003: SALA EDUCATIVA (PRITE",null,3,{"$f":"IF(AND(COUNTIF(N19:V19,\"X\")>0,COUNTIF(W19:AA19,\"X\")=0),1,IF(AND(COUNTIF(N19:V19,\"X\")=0,COUNTIF(W19:AA19,\"X\")>0),2,IF(AND(COUNTIF(N19:V19,\"X\")>0,COUNTIF(W19:AA19,\"X\")>0),3,0)))","v":0},{"$f":"IF(OR(D19=2,D19=3),\"X\",\"\")","v":""},{"$f":"IF('S400'!G37<>\"\",'S400'!G37,\"X\")","v":"X"},null,"","","","","","","","","","","","","","","","","","","","","","","","","","","","","","","","","","","","","","","","","","","","","","","","","","","","","","","","","","","","","","","","","","","","","","","","","","","","","","","","","","","","","","","","","","","","","","","","","","","","","","","","","","","","","","","",""]
["004: SALA DE USOS MÚLTIPLES (SUM)",null,4,0,"",{"$f":"IF('S400'!G38<>\"\",'S400'!G38,\"X\")","v":"X"},null,"","","","","","","","","","","","","","","","","","","","","","","","","","","","","","","","","","","","","","","","","","","","","","","","","","","","","","","","","","","","","","","","","","","","","","","","","","","","","","","","","","","","","","","","","","","","","","","","","","","","","","","","","","","","","","","",""]
["005: AUDITORIO",null,5,0,"",{"$f":"IF('S400'!G39<>\"\",'S400'!G39,\"X\")","v":"X"},null,"","","","","","","","","","","","","","","","","","","","","","","","","","","","","","","","","","","","","","","","","","","","","","","","","","","","","","","","","","","","","","","","","","","","","","","","","","","","","","","","","","","","","","","","","","","","","","","","","","","","","","","","","","","","","","","",""]
["006: SALA DE DANZA (PRIMARIA Y SECUNDARIA …",null,6,0,"",{"$f":"IF('S400'!G40<>\"\",'S400'!G40,\"X\")","v":"X"},null,"","","","","","","","","","","","","","","","","","","","","","","","","","","","","","","","","","","","","","","","","","","","","","","","","","","","","","","","","","","","","","","","","","","","","","","","","","","","","","","","","","","","","","","","","","","","","","","","","","","","","","","","","","","","","","","",""]
["007: SALA DE MÚSICA (PRIMARIA Y SECUNDARIA ...",null,7,0,"",{"$f":"IF('S400'!G41<>\"\",'S400'!G41,\"X\")","v":"X"},null,"","","","","","","","","","","","","","","","","","","","","","","","","","","","","","","","","","","","","","","","","","","","","","","","","","","","","","","","","","","","","","","","","","","","","","","","","","","","","","","","","","","","","","","","","","","","","","","","","","","","","","","","","","","","","","","",""]
["008: SALA DE DANZAS FOLCLÓRICAS (ESFA)",null,8,0,"",{"$f":"IF('S400'!G42<>\"\",'S400'!G42,\"X\")","v":"X"},null,"","","","","","","","","","","","","","","","","","","","","","","","","","","","","","","","","","","","","","","","","","","","","","","","","","","","","","","","","","","","","","","","","","","","","","","","","","","","","","","","","","","","","","","","","","","","","","","","","","","","","","","","","","","","","","","",""]
["009: SALA DE BALLET (ESFA)",null,9,0,"",{"$f":"IF('S400'!G43<>\"\",'S400'!G43,\"X\")","v":"X"},null,"","","","","","","","","","","","","","","","","","","","","","","","","","","","","","","","","","","","","","","","","","","","","","","","","","","","","","","","","","","","","","","","","","","","","","","","","","","","","","","","","","","","","","","","","","","","","","","","","","","","","","","","","","","","","","","",""]
["010: OTRO ESPACIO DE TIPO A O D O SIMILA ...",null,10,0,"",{"$f":"IF('S400'!G44<>\"\",'S400'!G44,\"X\")","v":"X"},null,"","","","","","","","","","","","","","","","","","","","","","","","","","","","","","","","","","","","","","","","","","","","","","","","","","","","","","","","","","","","","","","","","","","","","","","","","","","","","","","","","","","","","","","","","","","","","","","","","","","","","","","","","","","","","","","",""]
["011: BIBLIOTECA TIPO I–75 M2 O MENOS (PR ...",null,11,0,"",{"$f":"IF('S400'!G45<>\"\",'S400'!G45,\"X\")","v":"X"},null,"","","","","","","","","","","","","","","","","","","","","","","","","","","","","","","","","","","","","","","","","","","","","","","","","","","","","","","","","","","","","","","","","","","","","","","","","","","","","","","","","","","","","","","","","","","","","","","","","","","","","","","","","","","","","","","",""]
["012: BIBLIOTECA TIPO II–90 M2 (PRIMARIA  ...",null,12,0,"",{"$f":"IF('S400'!G46<>\"\",'S400'!G46,\"X\")","v":"X"},null,"","","","","","","","","","","","","","","","","","","","","","","","","","","","","","","","","","","","","","","","","","","","","","","","","","","","","","","","","","","","","","","","","","","","","","","","","","","","","","","","","","","","","","","","","","","","","","","","","","","","","","","","","","","","","","","",""]
["013: BIBLIOTECA TIPO III–120 M2 O MÁS (P ...",null,13,0,"",{"$f":"IF('S400'!G47<>\"\",'S400'!G47,\"X\")","v":"X"},null,"","","","","","","","","","","","","","","","","","","","","","","","","","","","","","","","","","","","","","","","","","","","","","","","","","","","","","","","","","","","","","","","","","","","","","","","","","","","","","","","","","","","","","","","","","","","","","","","","","","","","","","","","","","","","","","",""]
["014: BIBLIOTECA DE EDUCACIÓN SUPERIOR O  ...",null,14,0,"",{"$f":"IF('S400'!G48<>\"\",'S400'!G48,\"X\")","v":"X"},null,"","","","","","","","","","","","","","","","","","","","","","","","","","","","","","","","","","","","","","","","","","","","","","","","","","","","","","","","","","","","","","","","","","","","","","","","","","","","","","","","","","","","","","","","","","","","","","","","","","","","","","","","","","","","","","","",""]
["015: AULA DE INNOVACIÓN PEDAGÓGICA (PRIM ...",null,15,0,"",{"$f":"IF('S400'!G49<>\"\",'S400'!G49,\"X\")","v":"X"},null,"","","","","","","","","","","","","","","","","","","","","","","","","","","","","","","","","","","","","","","","","","","","","","","","","","","","","","","","","","","","","","","","","","","","","","","","","","","","","","","","","","","","","","","","","","","","","","","","","","","","","","","","","","","","","","","",""]
["016: AULA DE IDIOMAS (ED.SUPERIOR O ETP)",null,16,0,"",{"$f":"IF('S400'!G50<>\"\",'S400'!G50,\"X\")","v":"X"},null,"","","","","","","","","","","","","","","","","","","","","","","","","","","","","","","","","","","","","","","","","","","","","","","","","","","","","","","","","","","","","","","","","","","","","","","","","","","","","","","","","","","","","","","","","","","","","","","","","","","","","","","","","","","","","","","",""]
["017: CENTRO DE CÓMPUTO (ED.SUPERIOR O ET ...",null,17,0,"",{"$f":"IF('S400'!G51<>\"\",'S400'!G51,\"X\")","v":"X"},null,"","","","","","","","","","","","","","","","","","","","","","","","","","","","","","","","","","","","","","","","","","","","","","","","","","","","","","","","","","","","","","","","","","","","","","","","","","","","","","","","","","","","","","","","","","","","","","","","","","","","","","","","","","","","","","","",""]
["018: CENTRO DE RECURSOS (ED.SUPERIOR O E ...",null,18,0,"",{"$f":"IF('S400'!G52<>\"\",'S400'!G52,\"X\")","v":"X"},null,"","","","","","","","","","","","","","","","","","","","","","","","","","","","","","","","","","","","","","","","","","","","","","","","","","","","","","","","","","","","","","","","","","","","","","","","","","","","","","","","","","","","","","","","","","","","","","","","","","","","","","","","","","","","","","","",""]
["019: OTRO ESPACIO DE TIPO B O SIMILARES  ...",null,19,0,"",{"$f":"IF('S400'!G53<>\"\",'S400'!G53,\"X\")","v":"X"},null,"","","","","","","","","","","","","","","","","","","","","","","","","","","","","","","","","","","","","","","","","","","","","","","","","","","","","","","","","","","","","","","","","","","","","","","","","","","","","","","","","","","","","","","","","","","","","","","","","","","","","","","","","","","","","","","",""]
["020: LABORATORIO DE CIENCIA Y TECNOLOGÍA ...",null,20,0,"",{"$f":"IF('S400'!G54<>\"\",'S400'!G54,\"X\")","v":"X"},null,"","","","","","","","","","","","","","","","","","","","","","","","","","","","","","","","","","","","","","","","","","","","","","","","","","","","","","","","","","","","","","","","","","","","","","","","","","","","","","","","","","","","","","","","","","","","","","","","","","","","","","","","","","","","","","","",""]
["021: TALLER CREATIVO (PRIMARIA)",null,21,0,"",{"$f":"IF('S400'!G55<>\"\",'S400'!G55,\"X\")","v":"X"},null,"","","","","","","","","","","","","","","","","","","","","","","","","","","","","","","","","","","","","","","","","","","","","","","","","","","","","","","","","","","","","","","","","","","","","","","","","","","","","","","","","","","","","","","","","","","","","","","","","","","","","","","","","","","","","","","",""]
["022: TALLER DE ARTES ESCÉNICAS (CEBE)",null,22,0,"",{"$f":"IF('S400'!G56<>\"\",'S400'!G56,\"X\")","v":"X"},null,"","","","","","","","","","","","","","","","","","","","","","","","","","","","","","","","","","","","","","","","","","","","","","","","","","","","","","","","","","","","","","","","","","","","","","","","","","","","","","","","","","","","","","","","","","","","","","","","","","","","","","","","","","","","","","","",""]
["023: TALLER DE ARTE O CERÁMICA (SECUNDAR ...",null,23,0,"",{"$f":"IF('S400'!G57<>\"\",'S400'!G57,\"X\")","v":"X"},null,"","","","","","","","","","","","","","","","","","","","","","","","","","","","","","","","","","","","","","","","","","","","","","","","","","","","","","","","","","","","","","","","","","","","","","","","","","","","","","","","","","","","","","","","","","","","","","","","","","","","","","","","","","","","","","","",""]
["024: TALLER DE EDUCACIÓN PARA EL TRABAJO",null,24,0,"",{"$f":"IF('S400'!G58<>\"\",'S400'!G58,\"X\")","v":"X"},null,"","","","","","","","","","","","","","","","","","","","","","","","","","","","","","","","","","","","","","","","","","","","","","","","","","","","","","","","","","","","","","","","","","","","","","","","","","","","","","","","","","","","","","","","","","","","","","","","","","","","","","","","","","","","","","","",""]
["025: TALLER DE EDUCACIÓN PARA EL TRABAJO ...",null,25,0,"",{"$f":"IF('S400'!G59<>\"\",'S400'!G59,\"X\")","v":"X"},null,"","","","","","","","","","","","","","","","","","","","","","","","","","","","","","","","","","","","","","","","","","","","","","","","","","","","","","","","","","","","","","","","","","","","","","","","","","","","","","","","","","","","","","","","","","","","","","","","","","","","","","","","","","","","","","","",""]
["026: TALLER DE REPOSTERÍA Y COCINA (CEBE)",null,26,0,"",{"$f":"IF('S400'!G60<>\"\",'S400'!G60,\"X\")","v":"X"},null,"","","","","","","","","","","","","","","","","","","","","","","","","","","","","","","","","","","","","","","","","","","","","","","","","","","","","","","","","","","","","","","","","","","","","","","","","","","","","","","","","","","","","","","","","","","","","","","","","","","","","","","","","","","","","","","",""]
["027: OTRO ESPACIO DE TIPO C O SIMILARES  ...",null,27,0,"",{"$f":"IF('S400'!G61<>\"\",'S400'!G61,\"X\")","v":"X"},null,"","","","","","","","","","","","","","","","","","","","","","","","","","","","","","","","","","","","","","","","","","","","","","","","","","","","","","","","","","","","","","","","","","","","","","","","","","","","","","","","","","","","","","","","","","","","","","","","","","","","","","","","","","","","","","","",""]
["028: LABORATORIO DE IDIOMAS",null,28,0,"",{"$f":"IF('S400'!G62<>\"\",'S400'!G62,\"X\")","v":"X"},null,"","","","","","","","","","","","","","","","","","","","","","","","","","","","","","","","","","","","","","","","","","","","","","","","","","","","","","","","","","","","","","","","","","","","","","","","","","","","","","","","","","","","","","","","","","","","","","","","","","","","","","","","","","","","","","","",""]
["029: LABORATORIO DE CIENCIAS",null,29,0,"",{"$f":"IF('S400'!G63<>\"\",'S400'!G63,\"X\")","v":"X"},null,"","","","","","","","","","","","","","","","","","","","","","","","","","","","","","","","","","","","","","","","","","","","","","","","","","","","","","","","","","","","","","","","","","","","","","","","","","","","","","","","","","","","","","","","","","","","","","","","","","","","","","","","","","","","","","","",""]
["030: LABORATORIO MULTIFUNCIONAL, BIOQUÍM ...",null,30,0,"",{"$f":"IF('S400'!G64<>\"\",'S400'!G64,\"X\")","v":"X"},null,"","","","","","","","","","","","","","","","","","","","","","","","","","","","","","","","","","","","","","","","","","","","","","","","","","","","","","","","","","","","","","","","","","","","","","","","","","","","","","","","","","","","","","","","","","","","","","","","","","","","","","","","","","","","","","","",""]
["031: LABORATORIO DE FARMACIA",null,31,0,"",{"$f":"IF('S400'!G65<>\"\",'S400'!G65,\"X\")","v":"X"},null,"","","","","","","","","","","","","","","","","","","","","","","","","","","","","","","","","","","","","","","","","","","","","","","","","","","","","","","","","","","","","","","","","","","","","","","","","","","","","","","","","","","","","","","","","","","","","","","","","","","","","","","","","","","","","","","",""]
["032: LABORATORIO DE SUELOS",null,32,0,"",{"$f":"IF('S400'!G66<>\"\",'S400'!G66,\"X\")","v":"X"},null,"","","","","","","","","","","","","","","","","","","","","","","","","","","","","","","","","","","","","","","","","","","","","","","","","","","","","","","","","","","","","","","","","","","","","","","","","","","","","","","","","","","","","","","","","","","","","","","","","","","","","","","","","","","","","","","",""]
["033: LABORATORIO DE CONTROL DE CALIDAD",null,33,0,"",{"$f":"IF('S400'!G67<>\"\",'S400'!G67,\"X\")","v":"X"},null,{"$f":"IF($C49<=$L$10,C49,\"\")","v":""},"","","","","","","","","","","","","","","","","","","","","","","","","","","","","","","","","","","","","","","","","","","","","","","","","","","","","","","","","","","","","","","","","","","","","","","","","","","","","","","","","","","","","","","","","","","","","","","","","","","","","","","","","","","","","","",""]
["034: OTROS TIPOS DE LABORATORIOS PARA ED ...",null,34,0,"",{"$f":"IF('S400'!G68<>\"\",'S400'!G68,\"X\")","v":"X"},null,"","","","","","","","","","","","","","","","","","","","","","","","","","","","","","","","","","","","","","","","","","","","","","","","","","","","","","","","","","","","","","","","","","","","","","","","","","","","","","","","","","","","","","","","","","","","","","","","","","","","","","","","","","","","","","","",""]
["035: TALLER DE EDUCACIÓN PARA EL TRABAJO ...",null,35,0,"",{"$f":"IF('S400'!G69<>\"\",'S400'!G69,\"X\")","v":"X"},null,"","","","","","","","","","","","","","","","","","","","","","","","","","","","","","","","","","","","","","","","","","","","","","","","","","","","","","","","","","","","","","","","","","","","","","","","","","","","","","","","","","","","","","","","","","","","","","","","","","","","","","","","","","","","","","","",""]
["036: TALLER DE INFORMÁTICA",null,36,0,"",{"$f":"IF('S400'!G70<>\"\",'S400'!G70,\"X\")","v":"X"},null,"","","","","","","","","","","","","","","","","","","","","","","","","","","","","","","","","","","","","","","","","","","","","","","","","","","","","","","","","","","","","","","","","","","","","","","","","","","","","","","","","","","","","","","","","","","","","","","","","","","","","","","","","","","","","","","",""]
["037: TALLER DE CORTE, PEINADO, LACEADO Y ...",null,37,0,"",{"$f":"IF('S400'!G71<>\"\",'S400'!G71,\"X\")","v":"X"},null,"","","","","","","","","","","","","","","","","","","","","","","","","","","","","","","","","","","","","","","","","","","","","","","","","","","","","","","","","","","","","","","","","","","","","","","","","","","","","","","","","","","","","","","","","","","","","","","","","","","","","","","","","","","","","","","",""]
["038: TALLER DE PODOESTÉTICA",null,38,0,"",{"$f":"IF('S400'!G72<>\"\",'S400'!G72,\"X\")","v":"X"},null,"","","","","","","","","","","","","","","","","","","","","","","","","","","","","","","","","","","","","","","","","","","","","","","","","","","","","","","","","","","","","","","","","","","","","","","","","","","","","","","","","","","","","","","","","","","","","","","","","","","","","","","","","","","","","","","",""]
["039: TALLER DE LOCUCIÓN RADIAL",null,39,0,"",{"$f":"IF('S400'!G73<>\"\",'S400'!G73,\"X\")","v":"X"},null,"","","","","","","","","","","","","","","","","","","","","","","","","","","","","","","","","","","","","","","","","","","","","","","","","","","","","","","","","","","","","","","","","","","","","","","","","","","","","","","","","","","","","","","","","","","","","","","","","","","","","","","","","","","","","","","",""]
["040: TALLER DE RECEPCIÓN HOTELERA",null,40,0,"",{"$f":"IF('S400'!G74<>\"\",'S400'!G74,\"X\")","v":"X"},null,"","","","","","","","","","","","","","","","","","","","","","","","","","","","","","","","","","","","","","","","","","","","","","","","","","","","","","","","","","","","","","","","","","","","","","","","","","","","","","","","","","","","","","","","","","","","","","","","","","","","","","","","","","","","","","","",""]
["041: TALLER DE HOTELERÍA",null,41,0,"",{"$f":"IF('S400'!G75<>\"\",'S400'!G75,\"X\")","v":"X"},null,"","","","","","","","","","","","","","","","","","","","","","","","","","","","","","","","","","","","","","","","","","","","","","","","","","","","","","","","","","","","","","","","","","","","","","","","","","","","","","","","","","","","","","","","","","","","","","","","","","","","","","","","","","","","","","","",""]
["042: TALLER DE NEUMÁTICA E HIDRÁULICA",null,42,0,"",{"$f":"IF('S400'!G76<>\"\",'S400'!G76,\"X\")","v":"X"},null,"","","","","","","","","","","","","","","","","","","","","","","","","","","","","","","","","","","","","","","","","","","","","","","","","","","","","","","","","","","","","","","","","","","","","","","","","","","","","","","","","","","","","","","","","","","","","","","","","","","","","","","","","","","","","","","",""]
["043: TALLER DE CIRCUITOS ELÉCTRICOS Y/O  ...",null,43,0,"",{"$f":"IF('S400'!G77<>\"\",'S400'!G77,\"X\")","v":"X"},null,"","","","","","","","","","","","","","","","","","","","","","","","","","","","","","","","","","","","","","","","","","","","","","","","","","","","","","","","","","","","","","","","","","","","","","","","","","","","","","","","","","","","","","","","","","","","","","","","","","","","","","","","","","","","","","","",""]
["044: TALLER DE COCINA",null,44,0,"",{"$f":"IF('S400'!G78<>\"\",'S400'!G78,\"X\")","v":"X"},null,"","","","","","","","","","","","","","","","","","","","","","","","","","","","","","","","","","","","","","","","","","","","","","","","","","","","","","","","","","","","","","","","","","","","","","","","","","","","","","","","","","","","","","","","","","","","","","","","","","","","","","","","","","","","","","","",""]
["045: TALLER DE REPOSTERÍA",null,45,0,"",{"$f":"IF('S400'!G79<>\"\",'S400'!G79,\"X\")","v":"X"},null,"","","","","","","","","","","","","","","","","","","","","","","","","","","","","","","","","","","","","","","","","","","","","","","","","","","","","","","","","","","","","","","","","","","","","","","","","","","","","","","","","","","","","","","","","","","","","","","","","","","","","","","","","","","","","","","",""]
["046: TALLER DE BAR Y COCTELERÍA",null,46,0,"",{"$f":"IF('S400'!G80<>\"\",'S400'!G80,\"X\")","v":"X"},null,"","","","","","","","","","","","","","","","","","","","","","","","","","","","","","","","","","","","","","","","","","","","","","","","","","","","","","","","","","","","","","","","","","","","","","","","","","","","","","","","","","","","","","","","","","","","","","","","","","","","","","","","","","","","","","","",""]
["047: TALLER DE HOSPITALIZACIÓN",null,47,0,"",{"$f":"IF('S400'!G81<>\"\",'S400'!G81,\"X\")","v":"X"},null,"","","","","","","","","","","","","","","","","","","","","","","","","","","","","","","","","","","","","","","","","","","","","","","","","","","","","","","","","","","","","","","","","","","","","","","","","","","","","","","","","","","","","","","","","","","","","","","","","","","","","","","","","","","","","","","",""]
["048: TALLER DE TERAPIA (MOTRICIDAD, SENS ...",null,48,0,"",{"$f":"IF('S400'!G82<>\"\",'S400'!G82,\"X\")","v":"X"},null,"","","","","","","","","","","","","","","","","","","","","","","","","","","","","","","","","","","","","","","","","","","","","","","","","","","","","","","","","","","","","","","","","","","","","","","","","","","","","","","","","","","","","","","","","","","","","","","","","","","","","","","","","","","","","","","",""]
["049: TALLER DE DIBUJO TÉCNICO",null,49,0,"",{"$f":"IF('S400'!G83<>\"\",'S400'!G83,\"X\")","v":"X"},null,"","","","","","","","","","","","","","","","","","","","","","","","","","","","","","","","","","","","","","","","","","","","","","","","","","","","","","","","","","","","","","","","","","","","","","","","","","","","","","","","","","","","","","","","","","","","","","","","","","","","","","","","","","","","","","","",""]
["050: TALLER DE CORTE, CONFECCIÓN Y PATRO ...",null,50,0,"",{"$f":"IF('S400'!G84<>\"\",'S400'!G84,\"X\")","v":"X"},null,"","","","","","","","","","","","","","","","","","","","","","","","","","","","","","","","","","","","","","","","","","","","","","","","","","","","","","","","","","","","","","","","","","","","","","","","","","","","","","","","","","","","","","","","","","","","","","","","","","","","","","","","","","","","","","","",""]
["051: TALLER DE ESCULTURA",null,51,0,"",{"$f":"IF('S400'!G85<>\"\",'S400'!G85,\"X\")","v":"X"},null,"","","","","","","","","","","","","","","","","","","","","","","","","","","","","","","","","","","","","","","","","","","","","","","","","","","","","","","","","","","","","","","","","","","","","","","","","","","","","","","","","","","","","","","","","","","","","","","","","","","","","","","","","","","","","","","",""]
["052: TALLER PINTURA",null,52,0,"",{"$f":"IF('S400'!G86<>\"\",'S400'!G86,\"X\")","v":"X"},null,"","","","","","","","","","","","","","","","","","","","","","","","","","","","","","","","","","","","","","","","","","","","","","","","","","","","","","","","","","","","","","","","","","","","","","","","","","","","","","","","","","","","","","","","","","","","","","","","","","","","","","","","","","","","","","","",""]
["053: TALLER DE DIBUJO",null,53,0,"",{"$f":"IF('S400'!G87<>\"\",'S400'!G87,\"X\")","v":"X"},null,"","","","","","","","","","","","","","","","","","","","","","","","","","","","","","","","","","","","","","","","","","","","","","","","","","","","","","","","","","","","","","","","","","","","","","","","","","","","","","","","","","","","","","","","","","","","","","","","","","","","","","","","","","","","","","","",""]
["054: TALLER DE MEDICIONES ELÉCTRICAS",null,54,0,"",{"$f":"IF('S400'!G88<>\"\",'S400'!G88,\"X\")","v":"X"},null,"","","","","","","","","","","","","","","","","","","","","","","","","","","","","","","","","","","","","","","","","","","","","","","","","","","","","","","","","","","","","","","","","","","","","","","","","","","","","","","","","","","","","","","","","","","","","","","","","","","","","","","","","","","","","","","",""]
["055: TALLER DE MOTORES DE VEHÍCULOS",null,55,0,"",{"$f":"IF('S400'!G89<>\"\",'S400'!G89,\"X\")","v":"X"},null,"","","","","","","","","","","","","","","","","","","","","","","","","","","","","","","","","","","","","","","","","","","","","","","","","","","","","","","","","","","","","","","","","","","","","","","","","","","","","","","","","","","","","","","","","","","","","","","","","","","","","","","","","","","","","","","",""]
["056: TALLER DE MECÁNICA DE BANCO, SOLDAD ...",null,56,0,"",{"$f":"IF('S400'!G90<>\"\",'S400'!G90,\"X\")","v":"X"},null,"","","","","","","","","","","","","","","","","","","","","","","","","","","","","","","","","","","","","","","","","","","","","","","","","","","","","","","","","","","","","","","","","","","","","","","","","","","","","","","","","","","","","","","","","","","","","","","","","","","","","","","","","","","","","","","",""]
["057: TALLER DE TRANSMISIÓN DE VEHÍCULOS",null,57,0,"",{"$f":"IF('S400'!G91<>\"\",'S400'!G91,\"X\")","v":"X"},null,"","","","","","","","","","","","","","","","","","","","","","","","","","","","","","","","","","","","","","","","","","","","","","","","","","","","","","","","","","","","","","","","","","","","","","","","","","","","","","","","","","","","","","","","","","","","","","","","","","","","","","","","","","","","","","","",""]
["058: TALLER DE SOLDADURA",null,58,0,"",{"$f":"IF('S400'!G92<>\"\",'S400'!G92,\"X\")","v":"X"},null,"","","","","","","","","","","","","","","","","","","","","","","","","","","","","","","","","","","","","","","","","","","","","","","","","","","","","","","","","","","","","","","","","","","","","","","","","","","","","","","","","","","","","","","","","","","","","","","","","","","","","","","","","","","","","","","",""]
["059: TALLER DE INSTALACIONES ELÉCTRICAS",null,59,0,"",{"$f":"IF('S400'!G93<>\"\",'S400'!G93,\"X\")","v":"X"},null,"","","","","","","","","","","","","","","","","","","","","","","","","","","","","","","","","","","","","","","","","","","","","","","","","","","","","","","","","","","","","","","","","","","","","","","","","","","","","","","","","","","","","","","","","","","","","","","","","","","","","","","","","","","","","","","",""]
["060: TALLER DE INSTALACIONES SANITARIAS",null,60,0,"",{"$f":"IF('S400'!G94<>\"\",'S400'!G94,\"X\")","v":"X"},null,"","","","","","","","","","","","","","","","","","","","","","","","","","","","","","","","","","","","","","","","","","","","","","","","","","","","","","","","","","","","","","","","","","","","","","","","","","","","","","","","","","","","","","","","","","","","","","","","","","","","","","","","","","","","","","","",""]
["061: TALLER DE JOYERÍA",null,61,0,"",{"$f":"IF('S400'!G95<>\"\",'S400'!G95,\"X\")","v":"X"},null,"","","","","","","","","","","","","","","","","","","","","","","","","","","","","","","","","","","","","","","","","","","","","","","","","","","","","","","","","","","","","","","","","","","","","","","","","","","","","","","","","","","","","","","","","","","","","","","","","","","","","","","","","","","","","","","",""]
["062: OTROS TIPOS DE TALLERES PARA ED.SUP ...",null,62,0,"",{"$f":"IF('S400'!G96<>\"\",'S400'!G96,\"X\")","v":"X"},null,"","","","","","","","","","","","","","","","","","","","","","","","","","","","","","","","","","","","","","","","","","","","","","","","","","","","","","","","","","","","","","","","","","","","","","","","","","","","","","","","","","","","","","","","","","","","","","","","","","","","","","","","","","","","","","","",""]
["063: GIMNASIO (ED.BÁSICA)",null,63,0,"",{"$f":"IF('S400'!G97<>\"\",'S400'!G97,\"X\")","v":"X"},null,"","","","","","","","","","","","","","","","","","","","","","","","","","","","","","","","","","","","","","","","","","","","","","","","","","","","","","","","","","","","","","","","","","","","","","","","","","","","","","","","","","","","","","","","","","","","","","","","","","","","","","","","","","","","","","","",""]
["064: COLISEO POLIDEPORTIVO (ED.BÁSICA)",null,64,0,"",{"$f":"IF('S400'!G98<>\"\",'S400'!G98,\"X\")","v":"X"},null,"","","","","","","","","","","","","","","","","","","","","","","","","","","","","","","","","","","","","","","","","","","","","","","","","","","","","","","","","","","","","","","","","","","","","","","","","","","","","","","","","","","","","","","","","","","","","","","","","","","","","","","","","","","","","","","",""]
["065: PISCINA SEMIOLÍMPICA TECHADA (ED.BÁ ...",null,65,0,"",{"$f":"IF('S400'!G99<>\"\",'S400'!G99,\"X\")","v":"X"},null,{"$f":"IF($C81<=$L$10,C81,\"\")","v":""},"","","","","","","","","","","","","","","","","","","","","","","","","","","","","","","","","","","","","","","","","","","","","","","","","","","","","","","","","","","","","","","","","","","","","","","","","","","","","","","","","","","","","","","","","","","","","","","","","","","","","","","","","","","","","","",""]
["066: PISCINA OLÍMPICA TECHADA (ED.BÁSICA)",null,66,0,"",{"$f":"IF('S400'!G100<>\"\",'S400'!G100,\"X\")","v":"X"},null,"","","","","","","","","","","","","","","","","","","","","","","","","","","","","","","","","","","","","","","","","","","","","","","","","","","","","","","","","","","","","","","","","","","","","","","","","","","","","","","","","","","","","","","","","","","","","","","","","","","","","","","","","","","","","","","",""]
["067: OTRO ESPACIO DEPORTIVO CERRADO",null,67,{"$f":"IF(AND(COUNTIF(N83:V83,\"X\")>0,COUNTIF(W83:AA83,\"X\")=0),1,IF(AND(COUNTIF(N83:V83,\"X\")=0,COUNTIF(W83:AA83,\"X\")>0),2,IF(AND(COUNTIF(N83:V83,\"X\")>0,COUNTIF(W83:AA83,\"X\")>0),3,0)))","v":0},{"$f":"IF(OR(D83=2,D83=3),\"X\",\"\")","v":""},{"$f":"IF('S400'!G101<>\"\",'S400'!G101,\"X\")","v":"X"},null,"","","","","","","","","","","","","","","","","","","","","","","","","","","","","","","","","","","","","","","","","","","","","","","","","","","","","","","","","","","","","","","","","","","","","","","","","","","","","","","","","","","","","","","","","","","","","","","","","","","","","","","","","","","","","","","",""]
["068: QUIOSCO",null,68,0,"",{"$f":"IF('S400'!G102<>\"\",'S400'!G102,\"X\")","v":"X"},null,"","","","","","","","","","","","","","","","","","","","","","","","","","","","","","","","","","","","","","","","","","","","","","","","","","","","","","","","","","","","","","","","","","","","","","","","","","","","","","","","","","","","","","","","","","","","","","","","","","","","","","","","","","","","","","","",""]
["069: CAFETERÍA",null,69,0,"",{"$f":"IF('S400'!G103<>\"\",'S400'!G103,\"X\")","v":"X"},null,"","","","","","","","","","","","","","","","","","","","","","","","","","","","","","","","","","","","","","","","","","","","","","","","","","","","","","","","","","","","","","","","","","","","","","","","","","","","","","","","","","","","","","","","","","","","","","","","","","","","","","","","","","","","","","","",""]
["070: COMEDOR",null,70,0,"",{"$f":"IF('S400'!G104<>\"\",'S400'!G104,\"X\")","v":"X"},null,"","","","","","","","","","","","","","","","","","","","","","","","","","","","","","","","","","","","","","","","","","","","","","","","","","","","","","","","","","","","","","","","","","","","","","","","","","","","","","","","","","","","","","","","","","","","","","","","","","","","","","","","","","","","","","","",""]
["071: COCINA",null,71,0,"",{"$f":"IF('S400'!G105<>\"\",'S400'!G105,\"X\")","v":"X"},null,"","","","","","","","","","","","","","","","","","","","","","","","","","","","","","","","","","","","","","","","","","","","","","","","","","","","","","","","","","","","","","","","","","","","","","","","","","","","","","","","","","","","","","","","","","","","","","","","","","","","","","","","","","","","","","","",""]
["072: TÓPICO",null,72,0,"",{"$f":"IF('S400'!G106<>\"\",'S400'!G106,\"X\")","v":"X"},null,"","","","","","","","","","","","","","","","","","","","","","","","","","","","","","","","","","","","","","","","","","","","","","","","","","","","","","","","","","","","","","","","","","","","","","","","","","","","","","","","","","","","","","","","","","","","","","","","","","","","","","","","","","","","","","","",""]
["073: LACTARIO (PRITE O ED. SUPERIOR O ET ...",null,73,0,"",{"$f":"IF('S400'!G107<>\"\",'S400'!G107,\"X\")","v":"X"},null,"","","","","","","","","","","","","","","","","","","","","","","","","","","","","","","","","","","","","","","","","","","","","","","","","","","","","","","","","","","","","","","","","","","","","","","","","","","","","","","","","","","","","","","","","","","","","","","","","","","","","","","","","","","","","","","",""]
["074: ESPACIO TEMPORAL PARA DOCENTE (INIC ...",null,74,0,"",{"$f":"IF('S400'!G108<>\"\",'S400'!G108,\"X\")","v":"X"},null,"","","","","","","","","","","","","","","","","","","","","","","","","","","","","","","","","","","","","","","","","","","","","","","","","","","","","","","","","","","","","","","","","","","","","","","","","","","","","","","","","","","","","","","","","","","","","","","","","","","","","","","","","","","","","","","",""]
["075: RESIDENCIA ESTUDIANTIL (SECUNDARIA)",null,75,0,"",{"$f":"IF('S400'!G109<>\"\",'S400'!G109,\"X\")","v":"X"},null,"","","","","","","","","","","","","","","","","","","","","","","","","","","","","","","","","","","","","","","","","","","","","","","","","","","","","","","","","","","","","","","","","","","","","","","","","","","","","","","","","","","","","","","","","","","","","","","","","","","","","","","","","","","","","","","",""]
["076: ESPACIO TEMPORAL PARA ACOMPAÑAMIENT ...",null,76,0,"",{"$f":"IF('S400'!G110<>\"\",'S400'!G110,\"X\")","v":"X"},null,"","","","","","","","","","","","","","","","","","","","","","","","","","","","","","","","","","","","","","","","","","","","","","","","","","","","","","","","","","","","","","","","","","","","","","","","","","","","","","","","","","","","","","","","","","","","","","","","","","","","","","","","","","","","","","","",""]
["077: MÓDULO DE ACOMPAÑAMIENTO Y CONSEJER ...",null,77,0,"",{"$f":"IF('S400'!G111<>\"\",'S400'!G111,\"X\")","v":"X"},null,"","","","","","","","","","","","","","","","","","","","","","","","","","","","","","","","","","","","","","","","","","","","","","","","","","","","","","","","","","","","","","","","","","","","","","","","","","","","","","","","","","","","","","","","","","","","","","","","","","","","","","","","","","","","","","","",""]
["078: COORDINACIÓN DE TUTORÍA (JEC)",null,78,0,"",{"$f":"IF('S400'!G112<>\"\",'S400'!G112,\"X\")","v":"X"},null,"","","","","","","","","","","","","","","","","","","","","","","","","","","","","","","","","","","","","","","","","","","","","","","","","","","","","","","","","","","","","","","","","","","","","","","","","","","","","","","","","","","","","","","","","","","","","","","","","","","","","","","","","","","","","","","",""]
["079: SALA EQUIPO SAANEE (CEBE)",null,79,0,"",{"$f":"IF('S400'!G113<>\"\",'S400'!G113,\"X\")","v":"X"},null,"","","","","","","","","","","","","","","","","","","","","","","","","","","","","","","","","","","","","","","","","","","","","","","","","","","","","","","","","","","","","","","","","","","","","","","","","","","","","","","","","","","","","","","","","","","","","","","","","","","","","","","","","","","","","","","",""]
["080: SALA PSICOPEDAGÓGICA (CEBE O ED. SU ...",null,80,0,"",{"$f":"IF('S400'!G114<>\"\",'S400'!G114,\"X\")","v":"X"},null,"","","","","","","","","","","","","","","","","","","","","","","","","","","","","","","","","","","","","","","","","","","","","","","","","","","","","","","","","","","","","","","","","","","","","","","","","","","","","","","","","","","","","","","","","","","","","","","","","","","","","","","","","","","","","","","",""]
["081: OFICINA APAFA (CEBE)",null,81,0,"",{"$f":"IF('S400'!G115<>\"\",'S400'!G115,\"X\")","v":"X"},null,"","","","","","","","","","","","","","","","","","","","","","","","","","","","","","","","","","","","","","","","","","","","","","","","","","","","","","","","","","","","","","","","","","","","","","","","","","","","","","","","","","","","","","","","","","","","","","","","","","","","","","","","","","","","","","","",""]
["082: UNIDAD DE BIENESTAR Y EMPLEABILIDAD ...",null,82,0,"",{"$f":"IF('S400'!G116<>\"\",'S400'!G116,\"X\")","v":"X"},null,"","","","","","","","","","","","","","","","","","","","","","","","","","","","","","","","","","","","","","","","","","","","","","","","","","","","","","","","","","","","","","","","","","","","","","","","","","","","","","","","","","","","","","","","","","","","","","","","","","","","","","","","","","","","","","","",""]
["083: CAPILLA, TEMPLO O SIMILAR. (ED.SUPE ...",null,83,0,"",null,null,"","","","","","","","","","","","","","","","","","","","","","","","","","","","","","","","","","","","","","","","","","","","","","","","","","","","","","","","","","","","","","","","","","","","","","","","","","","","","","","","","","","","","","","","","","","","","","","","","","","","","","","","","","","","","","","",""]
["084: OTRO ESPACIO PARA BIENESTAR",null,84,0,"",null,null,"","","","","","","","","","","","","","","","","","","","","","","","","","","","","","","","","","","","","","","","","","","","","","","","","","","","","","","","","","","","","","","","","","","","","","","","","","","","","","","","","","","","","","","","","","","","","","","","","","","","","","","","","","","","","","","",""]
["085: ALMACÉN GENERAL",null,85,0,"",null,null,"","","","","","","","","","","","","","","","","","","","","","","","","","","","","","","","","","","","","","","","","","","","","","","","","","","","","","","","","","","","","","","","","","","","","","","","","","","","","","","","","","","","","","","","","","","","","","","","","","","","","","","","","","","","","","","",""]
["086: DEPÓSITO GENERAL (ED.BÁSICA)",null,86,0,"",null,null,"","","","","","","","","","","","","","","","","","","","","","","","","","","","","","","","","","","","","","","","","","","","","","","","","","","","","","","","","","","","","","","","","","","","","","","","","","","","","","","","","","","","","","","","","","","","","","","","","","","","","","","","","","","","","","","",""]
["087: VIGILANCIA O CASETA DE CONTROL",null,87,0,"",null,null,"","","","","","","","","","","","","","","","","","","","","","","","","","","","","","","","","","","","","","","","","","","","","","","","","","","","","","","","","","","","","","","","","","","","","","","","","","","","","","","","","","","","","","","","","","","","","","","","","","","","","","","","","","","","","","","",""]
["088: CUARTO DE MÁQUINAS Y CISTERNAS",null,88,0,"",null,null,"","","","","","","","","","","","","","","","","","","","","","","","","","","","","","","","","","","","","","","","","","","","","","","","","","","","","","","","","","","","","","","","","","","","","","","","","","","","","","","","","","","","","","","","","","","","","","","","","","","","","","","","","","","","","","","",""]
["089: AMBIENTE PARA ALMACENAMIENTO DE RES ...",null,89,0,"",null,null,"","","","","","","","","","","","","","","","","","","","","","","","","","","","","","","","","","","","","","","","","","","","","","","","","","","","","","","","","","","","","","","","","","","","","","","","","","","","","","","","","","","","","","","","","","","","","","","","","","","","","","","","","","","","","","","",""]
["090: CUARTO DE LIMPIEZA",null,90,0,"",null,null,"","","","","","","","","","","","","","","","","","","","","","","","","","","","","","","","","","","","","","","","","","","","","","","","","","","","","","","","","","","","","","","","","","","","","","","","","","","","","","","","","","","","","","","","","","","","","","","","","","","","","","","","","","","","","","","",""]
["091: CUARTO ELÉCTRICO",null,91,0,"",null,null,"","","","","","","","","","","","","","","","","","","","","","","","","","","","","","","","","","","","","","","","","","","","","","","","","","","","","","","","","","","","","","","","","","","","","","","","","","","","","","","","","","","","","","","","","","","","","","","","","","","","","","","","","","","","","","","",""]
["092: GUARDIANÍA (ED.BÁSICA) ",null,92,0,"",null,null,"","","","","","","","","","","","","","","","","","","","","","","","","","","","","","","","","","","","","","","","","","","","","","","","","","","","","","","","","","","","","","","","","","","","","","","","","","","","","","","","","","","","","","","","","","","","","","","","","","","","","","","","","","","","","","","",""]
["093: MAESTRANZA",null,93,0,"",null,null,"","","","","","","","","","","","","","","","","","","","","","","","","","","","","","","","","","","","","","","","","","","","","","","","","","","","","","","","","","","","","","","","","","","","","","","","","","","","","","","","","","","","","","","","","","","","","","","","","","","","","","","","","","","","","","","",""]
["094: MÓDULO DE CONECTIVIDAD (ESPACIO PAR ...",null,94,0,"",null,null,"","","","","","","","","","","","","","","","","","","","","","","","","","","","","","","","","","","","","","","","","","","","","","","","","","","","","","","","","","","","","","","","","","","","","","","","","","","","","","","","","","","","","","","","","","","","","","","","","","","","","","","","","","","","","","","",""]
["095: DEPÓSITO DE IMPLEMENTOS DEPORTIVOS",null,95,0,"",null,null,"","","","","","","","","","","","","","","","","","","","","","","","","","","","","","","","","","","","","","","","","","","","","","","","","","","","","","","","","","","","","","","","","","","","","","","","","","","","","","","","","","","","","","","","","","","","","","","","","","","","","","","","","","","","","","","",""]
["096: DEPÓSITO DE HERRAMIENTAS Y MATERIAL ...",null,96,0,"",null,null,"","","","","","","","","","","","","","","","","","","","","","","","","","","","","","","","","","","","","","","","","","","","","","","","","","","","","","","","","","","","","","","","","","","","","","","","","","","","","","","","","","","","","","","","","","","","","","","","","","","","","","","","","","","","","","","",""]
["097: DEPÓSITO DE PRODUCTOS (TIPO G)",null,97,0,"",null,null,{"$f":"IF($C113<=$L$10,C113,\"\")","v":""},"","","","","","","","","","","","","","","","","","","","","","","","","","","","","","","","","","","","","","","","","","","","","","","","","","","","","","","","","","","","","","","","","","","","","","","","","","","","","","","","","","","","","","","","","","","","","","","","","","","","","","","","","","","","","","",""]
["098: OTRO ESPACIO DE SERVICIOS GENERALES ...",null,98,0,"",null,null,"","","","","","","","","","","","","","","","","","","","","","","","","","","","","","","","","","","","","","","","","","","","","","","","","","","","","","","","","","","","","","","","","","","","","","","","","","","","","","","","","","","","","","","","","","","","","","","","","","","","","","","","","","","","","","","",""]
["099: DIRECCIÓN / DIRECCIÓN GENERAL",null,99,0,"",null,null,"","","","","","","","","","","","","","","","","","","","","","","","","","","","","","","","","","","","","","","","","","","","","","","","","","","","","","","","","","","","","","","","","","","","","","","","","","","","","","","","","","","","","","","","","","","","","","","","","","","","","","","","","","","","","","","",""]
["100: SUBDIRECCIÓN (ED.BÁSICA, ED. SUPERI ...",null,100,0,"",null,null,"","","","","","","","","","","","","","","","","","","","","","","","","","","","","","","","","","","","","","","","","","","","","","","","","","","","","","","","","","","","","","","","","","","","","","","","","","","","","","","","","","","","","","","","","","","","","","","","","","","","","","","","","","","","","","","",""]
["101: ADMINISTRACIÓN /ÁREA ADMINISTRATIVA",null,101,0,"",null,null,"","","","","","","","","","","","","","","","","","","","","","","","","","","","","","","","","","","","","","","","","","","","","","","","","","","","","","","","","","","","","","","","","","","","","","","","","","","","","","","","","","","","","","","","","","","","","","","","","","","","","","","","","","","","","","","",""]
["102: OFICINA DE COORDINACIÓN PEDAGÓGICA  ...",null,102,0,"",null,null,"","","","","","","","","","","","","","","","","","","","","","","","","","","","","","","","","","","","","","","","","","","","","","","","","","","","","","","","","","","","","","","","","","","","","","","","","","","","","","","","","","","","","","","","","","","","","","","","","","","","","","","","","","","","","","","",""]
["103: ÁREA DE ESPERA Y/O SECRETARIA",null,103,0,"",null,null,"","","","","","","","","","","","","","","","","","","","","","","","","","","","","","","","","","","","","","","","","","","","","","","","","","","","","","","","","","","","","","","","","","","","","","","","","","","","","","","","","","","","","","","","","","","","","","","","","","","","","","","","","","","","","","","",""]
["104: ARCHIVO, ECONOMATO Y/O DEPÓSITO DOC ...",null,104,0,"",null,null,"","","","","","","","","","","","","","","","","","","","","","","","","","","","","","","","","","","","","","","","","","","","","","","","","","","","","","","","","","","","","","","","","","","","","","","","","","","","","","","","","","","","","","","","","","","","","","","","","","","","","","","","","","","","","","","",""]
["105: SALA DE DOCENTES / SALA PARA EL PER ...",null,105,0,"",null,null,"","","","","","","","","","","","","","","","","","","","","","","","","","","","","","","","","","","","","","","","","","","","","","","","","","","","","","","","","","","","","","","","","","","","","","","","","","","","","","","","","","","","","","","","","","","","","","","","","","","","","","","","","","","","","","","",""]
["106: SALA DE REUNIONES",null,106,0,"",null,null,"","","","","","","","","","","","","","","","","","","","","","","","","","","","","","","","","","","","","","","","","","","","","","","","","","","","","","","","","","","","","","","","","","","","","","","","","","","","","","","","","","","","","","","","","","","","","","","","","","","","","","","","","","","","","","","",""]
["107: SALA DE PROFESIONALES (CEBE)",null,107,0,"",null,null,"","","","","","","","","","","","","","","","","","","","","","","","","","","","","","","","","","","","","","","","","","","","","","","","","","","","","","","","","","","","","","","","","","","","","","","","","","","","","","","","","","","","","","","","","","","","","","","","","","","","","","","","","","","","","","","",""]
["108: UNIDAD ACADÉMICA (ED.SUPERIOR O ETP ...",null,108,0,"",null,null,"","","","","","","","","","","","","","","","","","","","","","","","","","","","","","","","","","","","","","","","","","","","","","","","","","","","","","","","","","","","","","","","","","","","","","","","","","","","","","","","","","","","","","","","","","","","","","","","","","","","","","","","","","","","","","","",""]
["109: COORDINACIÓN DE PROGRAMAS DE ESTUDI ...",null,109,0,"",null,null,"","","","","","","","","","","","","","","","","","","","","","","","","","","","","","","","","","","","","","","","","","","","","","","","","","","","","","","","","","","","","","","","","","","","","","","","","","","","","","","","","","","","","","","","","","","","","","","","","","","","","","","","","","","","","","","",""]
["110: UNIDAD DE INVESTIGACIÓN (ED.SUPERIO ...",null,110,0,"",null,null,"","","","","","","","","","","","","","","","","","","","","","","","","","","","","","","","","","","","","","","","","","","","","","","","","","","","","","","","","","","","","","","","","","","","","","","","","","","","","","","","","","","","","","","","","","","","","","","","","","","","","","","","","","","","","","","",""]
["111: UNIDAD DE FORMACIÓN CONTINUA (ED.SU ...",null,111,0,"",null,null,"","","","","","","","","","","","","","","","","","","","","","","","","","","","","","","","","","","","","","","","","","","","","","","","","","","","","","","","","","","","","","","","","","","","","","","","","","","","","","","","","","","","","","","","","","","","","","","","","","","","","","","","","","","","","","","",""]
["112: ÁREA DE CALIDAD (ED.SUPERIOR O ETP)",null,112,0,"",null,null,"","","","","","","","","","","","","","","","","","","","","","","","","","","","","","","","","","","","","","","","","","","","","","","","","","","","","","","","","","","","","","","","","","","","","","","","","","","","","","","","","","","","","","","","","","","","","","","","","","","","","","","","","","","","","","","",""]
["113: SECRETARÍA ACADÉMICA (ED.SUPERIOR O ...",null,113,0,"",null,null,"","","","","","","","","","","","","","","","","","","","","","","","","","","","","","","","","","","","","","","","","","","","","","","","","","","","","","","","","","","","","","","","","","","","","","","","","","","","","","","","","","","","","","","","","","","","","","","","","","","","","","","","","","","","","","","",""]
["114: OTRO ESPACIO DE GESTIÓN ADMINISTRAT ...",null,114,0,"",null,null,"","","","","","","","","","","","","","","","","","","","","","","","","","","","","","","","","","","","","","","","","","","","","","","","","","","","","","","","","","","","","","","","","","","","","","","","","","","","","","","","","","","","","","","","","","","","","","","","","","","","","","","","","","","","","","","",""]
[null,null,115,0,"",null,null,"","","","","","","","","","","","","","","","","","","","","","","","","","","","","","","","","","","","","","","","","","","","","","","","","","","","","","","","","","","","","","","","","","","","","","","","","","","","","","","","","","","","","","","","","","","","","","","","","","","","","","","","","","","","","","","",""]
[null,null,116,0,"",null,null,"","","","","","","","","","","","","","","","","","","","","","","","","","","","","","","","","","","","","","","","","","","","","","","","","","","","","","","","","","","","","","","","","","","","","","","","","","","","","","","","","","","","","","","","","","","","","","","","","","","","","","","","","","","","","","","",""]
[null,null,117,0,"",null,null,"","","","","","","","","","","","","","","","","","","","","","","","","","","","","","","","","","","","","","","","","","","","","","","","","","","","","","","","","","","","","","","","","","","","","","","","","","","","","","","","","","","","","","","","","","","","","","","","","","","","","","","","","","","","","","","",""]
[null,null,118,0,"",null,null,"","","","","","","","","","","","","","","","","","","","","","","","","","","","","","","","","","","","","","","","","","","","","","","","","","","","","","","","","","","","","","","","","","","","","","","","","","","","","","","","","","","","","","","","","","","","","","","","","","","","","","","","","","","","","","","",""]
[null,null,119,0,"",null,null,"","","","","","","","","","","","","","","","","","","","","","","","","","","","","","","","","","","","","","","","","","","","","","","","","","","","","","","","","","","","","","","","","","","","","","","","","","","","","","","","","","","","","","","","","","","","","","","","","","","","","","","","","","","","","","","",""]
[null,null,120,0,"",null,null,"","","","","","","","","","","","","","","","","","","","","","","","","","","","","","","","","","","","","","","","","","","","","","","","","","","","","","","","","","","","","","","","","","","","","","","","","","","","","","","","","","","","","","","","","","","","","","","","","","","","","","","","","","","","","","","",""]
[null,null,121,0,"",null,null,"","","","","","","","","","","","","","","","","","","","","","","","","","","","","","","","","","","","","","","","","","","","","","","","","","","","","","","","","","","","","","","","","","","","","","","","","","","","","","","","","","","","","","","","","","","","","","","","","","","","","","","","","","","","","","","",""]
[null,null,122,0,"",null,null,"","","","","","","","","","","","","","","","","","","","","","","","","","","","","","","","","","","","","","","","","","","","","","","","","","","","","","","","","","","","","","","","","","","","","","","","","","","","","","","","","","","","","","","","","","","","","","","","","","","","","","","","","","","","","","","",""]
[null,null,123,0,"",null,null,"","","","","","","","","","","","","","","","","","","","","","","","","","","","","","","","","","","","","","","","","","","","","","","","","","","","","","","","","","","","","","","","","","","","","","","","","","","","","","","","","","","","","","","","","","","","","","","","","","","","","","","","","","","","","","","",""]
[null,null,124,0,"",null,null,"","","","","","","","","","","","","","","","","","","","","","","","","","","","","","","","","","","","","","","","","","","","","","","","","","","","","","","","","","","","","","","","","","","","","","","","","","","","","","","","","","","","","","","","","","","","","","","","","","","","","","","","","","","","","","","",""]
["Tabla : Si, No",null,125,0,"",null,null,"","","","","","","","","","","","","","","","","","","","","","","","","","","","","","","","","","","","","","","","","","","","","","","","","","","","","","","","","","","","","","","","","","","","","","","","","","","","","","","","","","","","","","","","","","","","","","","","","","","","","","","","","","","","","","","",""]
["SI: Para tal fin",null,126,0,"",null,null,"","","","","","","","","","","","","","","","","","","","","","","","","","","","","","","","","","","","","","","","","","","","","","","","","","","","","","","","","","","","","","","","","","","","","","","","","","","","","","","","","","","","","","","","","","","","","","","","","","","","","","","","","","","","","","","",""]
["NO: Adecuado",null,127,0,"",null,null,"","","","","","","","","","","","","","","","","","","","","","","","","","","","","","","","","","","","","","","","","","","","","","","","","","","","","","","","","","","","","","","","","","","","","","","","","","","","","","","","","","","","","","","","","","","","","","","","","","","","","","","","","","","","","","","",""]
[null,null,128,0,"",null,null,"","","","","","","","","","","","","","","","","","","","","","","","","","","","","","","","","","","","","","","","","","","","","","","","","","","","","","","","","","","","","","","","","","","","","","","","","","","","","","","","","","","","","","","","","","","","","","","","","","","","","","","","","","","","","","","",""]
["Tabla : Si, No",null,129,0,"",null,null,{"$f":"IF($C145<=$L$10,C145,\"\")","v":""},"","","","","","","","","","","","","","","","","","","","","","","","","","","","","","","","","","","","","","","","","","","","","","","","","","","","","","","","","","","","","","","","","","","","","","","","","","","","","","","","","","","","","","","","","","","","","","","","","","","","","","","","","","","","","","",""]
["SI",null,130,0,"",null,null,"","","","","","","","","","","","","","","","","","","","","","","","","","","","","","","","","","","","","","","","","","","","","","","","","","","","","","","","","","","","","","","","","","","","","","","","","","","","","","","","","","","","","","","","","","","","","","","","","","","","","","","","","","","","","","","",""]
["NO",null,131,{"$f":"IF(AND(COUNTIF(N147:V147,\"X\")>0,COUNTIF(W147:AA147,\"X\")=0),1,IF(AND(COUNTIF(N147:V147,\"X\")=0,COUNTIF(W147:AA147,\"X\")>0),2,IF(AND(COUNTIF(N147:V147,\"X\")>0,COUNTIF(W147:AA147,\"X\")>0),3,0)))","v":0},{"$f":"IF(OR(D147=2,D147=3),\"X\",\"\")","v":""},null,null,"","","","","","","","","","","","","","","","","","","","","","","","","","","","","","","","","","","","","","","","","","","","","","","","","","","","","","","","","","","","","","","","","","","","","","","","","","","","","","","","","","","","","","","","","","","","","","","","","","","","","","","","","","","","","","","",""]
["NA",null,132,0,"",null,null,"","","","","","","","","","","","","","","","","","","","","","","","","","","","","","","","","","","","","","","","","","","","","","","","","","","","","","","","","","","","","","","","","","","","","","","","","","","","","","","","","","","","","","","","","","","","","","","","","","","","","","","","","","","","","","","",""]
["TABLA 02 - Puertas",null,133,0,"",null,null,"","","","","","","","","","","","","","","","","","","","","","","","","","","","","","","","","","","","","","","","","","","","","","","","","","","","","","","","","","","","","","","","","","","","","","","","","","","","","","","","","","","","","","","","","","","","","","","","","","","","","","","","","","","","","","","",""]
["01: Madera",null,134,0,"",null,null,"","","","","","","","","","","","","","","","","","","","","","","","","","","","","","","","","","","","","","","","","","","","","","","","","","","","","","","","","","","","","","","","","","","","","","","","","","","","","","","","","","","","","","","","","","","","","","","","","","","","","","","","","","","","","","","",""]
["02: Mallas metálicas",null,135,0,"",null,null,"","","","","","","","","","","","","","","","","","","","","","","","","","","","","","","","","","","","","","","","","","","","","","","","","","","","","","","","","","","","","","","","","","","","","","","","","","","","","","","","","","","","","","","","","","","","","","","","","","","","","","","","","","","","","","","",""]
["03: Rejas metálicas",null,136,0,"",null,null,"","","","","","","","","","","","","","","","","","","","","","","","","","","","","","","","","","","","","","","","","","","","","","","","","","","","","","","","","","","","","","","","","","","","","","","","","","","","","","","","","","","","","","","","","","","","","","","","","","","","","","","","","","","","","","","",""]
["04: Planchas metálicas",null,137,0,"",null,null,"","","","","","","","","","","","","","","","","","","","","","","","","","","","","","","","","","","","","","","","","","","","","","","","","","","","","","","","","","","","","","","","","","","","","","","","","","","","","","","","","","","","","","","","","","","","","","","","","","","","","","","","","","","","","","","",""]
["05: Drywall",null,138,0,"",null,null,"","","","","","","","","","","","","","","","","","","","","","","","","","","","","","","","","","","","","","","","","","","","","","","","","","","","","","","","","","","","","","","","","","","","","","","","","","","","","","","","","","","","","","","","","","","","","","","","","","","","","","","","","","","","","","","",""]
["06: Vidrio",null,139,0,"",null,null,"","","","","","","","","","","","","","","","","","","","","","","","","","","","","","","","","","","","","","","","","","","","","","","","","","","","","","","","","","","","","","","","","","","","","","","","","","","","","","","","","","","","","","","","","","","","","","","","","","","","","","","","","","","","","","","",""]
["07: Otro",null,140,0,"",null,null,"","","","","","","","","","","","","","","","","","","","","","","","","","","","","","","","","","","","","","","","","","","","","","","","","","","","","","","","","","","","","","","","","","","","","","","","","","","","","","","","","","","","","","","","","","","","","","","","","","","","","","","","","","","","","","","",""]
["08: NT. Lo requiere",null,141,0,"",null,null,"","","","","","","","","","","","","","","","","","","","","","","","","","","","","","","","","","","","","","","","","","","","","","","","","","","","","","","","","","","","","","","","","","","","","","","","","","","","","","","","","","","","","","","","","","","","","","","","","","","","","","","","","","","","","","","",""]
["09: NT. No lo requiere",null,142,0,"",null,null,"","","","","","","","","","","","","","","","","","","","","","","","","","","","","","","","","","","","","","","","","","","","","","","","","","","","","","","","","","","","","","","","","","","","","","","","","","","","","","","","","","","","","","","","","","","","","","","","","","","","","","","","","","","","","","","",""]
[null,null,143,0,"",null,null,"","","","","","","","","","","","","","","","","","","","","","","","","","","","","","","","","","","","","","","","","","","","","","","","","","","","","","","","","","","","","","","","","","","","","","","","","","","","","","","","","","","","","","","","","","","","","","","","","","","","","","","","","","","","","","","",""]
["TABLA 03 - Ventanas",null,144,0,"",null,null,"","","","","","","","","","","","","","","","","","","","","","","","","","","","","","","","","","","","","","","","","","","","","","","","","","","","","","","","","","","","","","","","","","","","","","","","","","","","","","","","","","","","","","","","","","","","","","","","","","","","","","","","","","","","","","","",""]
["01: Carp. metálica",null,145,0,"",null,null,"","","","","","","","","","","","","","","","","","","","","","","","","","","","","","","","","","","","","","","","","","","","","","","","","","","","","","","","","","","","","","","","","","","","","","","","","","","","","","","","","","","","","","","","","","","","","","","","","","","","","","","","","","","","","","","",""]
["02: Carp. de madera",null,146,0,"",null,null,"","","","","","","","","","","","","","","","","","","","","","","","","","","","","","","","","","","","","","","","","","","","","","","","","","","","","","","","","","","","","","","","","","","","","","","","","","","","","","","","","","","","","","","","","","","","","","","","","","","","","","","","","","","","","","","",""]
["03: Carp. de PVC",null,147,0,"",null,null,"","","","","","","","","","","","","","","","","","","","","","","","","","","","","","","","","","","","","","","","","","","","","","","","","","","","","","","","","","","","","","","","","","","","","","","","","","","","","","","","","","","","","","","","","","","","","","","","","","","","","","","","","","","","","","","",""]
["04: Carp. mixta",null,148,0,"",null,null,"","","","","","","","","","","","","","","","","","","","","","","","","","","","","","","","","","","","","","","","","","","","","","","","","","","","","","","","","","","","","","","","","","","","","","","","","","","","","","","","","","","","","","","","","","","","","","","","","","","","","","","","","","","","","","","",""]
["05: Otro",null,149,0,"",null,null,"","","","","","","","","","","","","","","","","","","","","","","","","","","","","","","","","","","","","","","","","","","","","","","","","","","","","","","","","","","","","","","","","","","","","","","","","","","","","","","","","","","","","","","","","","","","","","","","","","","","","","","","","","","","","","","",""]
["06: NT. Lo requiere",null,150,0,"",null,null,"","","","","","","","","","","","","","","","","","","","","","","","","","","","","","","","","","","","","","","","","","","","","","","","","","","","","","","","","","","","","","","","","","","","","","","","","","","","","","","","","","","","","","","","","","","","","","","","","","","","","","","","","","","","","","","",""]
["07: NT. No lo requiere",null,151,0,""]
[null,null,152,0,"",null,null,"Limite","Limite","Limite","Limite","Limite","Limite","Limite","Limite","Limite","Limite","Limite","Limite","Limite","Limite","Limite","Limite","Limite","Limite","Limite","Limite","Limite","Limite","Limite","Limite","Limite","Limite","Limite","Limite","Limite","Limite","Limite","Limite","Limite","Limite","Limite","Limite","Limite","Limite","Limite","Limite","Limite","Limite","Limite","Limite","Limite","Limite","Limite","Limite","Limite","Limite",null,"Limite",null,null,"Limite","Limite","Limite","Limite","Limite","Limite","Limite","Limite","Limite","Limite","Limite","Limite","Limite","Limite","Limite","Limite","Limite","Limite","Limite","Limite","Limite","Limite","Limite","Limite","Limite","Limite","Limite","Limite","Limite","Limite","Limite","Limite","Limite","Limite","Limite","Limite","Limite","Limite","Limite","Limite","Limite","Limite","Limite","Limite","Limite","Limite","Limite","Limite","Limite","Limite","Limite","Limite","Limite","Limite","Limite","Limite","Limite","Limite"]
[null,null,153,0,""]
["TABLA 04 - Estado",null,154,0,""]
["01: Bueno",null,155,0,""]
["02: Regular",null,156,0,""]
["03: Malo",null,157,0,""]
["04: No aplica",null,158,0,""]
[null,null,159,0,""]
[null,null,160,0,""]
["TABLA 05 - Paredes",null,161,0,""]
["01: Ladrillo o concreto",null,162,0,""]
["02: Adobe o tapial",null,163,0,""]
["03: Quincha",null,164,0,""]
["04: Piedra con barro cal o cemento",null,165,0,""]
["05: Madera",null,166,0,""]
["06: Triplay",null,167,0,""]
["07: Eternit o fibra de concreto",null,168,0,""]
["08: Estera, cartón o plástico",null,169,0,""]
["09: Otro",null,170,0,""]
[null,null,171,0,""]
[null,null,172,0,""]
[null,null,173,0,""]
["TABLA 06 - Techo",null,174,0,""]
["01: Concreto armado",null,175,0,""]
["02: Madera",null,176,0,""]
["03: Teja",null,177,0,""]
["04: Fibra de cemento",null,178,0,""]
["05: Calamina",null,179,0,""]
["06: Calaminon",null,180,0,""]
["07: Eternit",null,181,0,""]
["08: Caña con barro",null,182,0,""]
["09: Lata o latón",null,183,0,""]
["10: Otro",null,184,0,""]
[null,null,185,0,""]
[null,null,186,0,""]
[null,null,187,0,""]
["TABLA 07 - Piso",null,188,0,""]
["01: Parquet o madera pulida",null,189,0,""]
["02: Vinilico, pisopak o similar",null,190,0,""]
["03: Loseta, cerámico o similar",null,191,0,""]
["04: Cemento",null,192,0,""]
["05: Madera entablado",null,193,0,""]
["06: Tierra",null,194,0,""]
["07: Otro",null,195,{"$f":"IF(AND(COUNTIF(N211:V211,\"X\")>0,COUNTIF(W211:AA211,\"X\")=0),1,IF(AND(COUNTIF(N211:V211,\"X\")=0,COUNTIF(W211:AA211,\"X\")>0),2,IF(AND(COUNTIF(N211:V211,\"X\")>0,COUNTIF(W211:AA211,\"X\")>0),3,0)))","v":0},{"$f":"IF(OR(D211=2,D211=3),\"X\",\"\")","v":""}]
[null,null,196,0,""]
[null,null,197,0,""]
[null,null,198,0,""]
[null,null,199,0,""]
[null,null,200,0,""]

{"sheet":"S605","index":9,"n_rows":115,"n_cols":56,"rows_kept":115,"cut":false,"hidden":false,"merged":[[105,21,105,28],[63,54,65,54],[64,51,65,51],[64,49,65,49],[64,48,65,48],[64,52,64,53],[62,13,63,46],[62,51,62,53],[63,50,65,50],[63,51,63,53],[64,13,64,21],[63,12,65,12],[63,47,65,47],[63,48,63,49],[62,48,62,49],[1,12,1,35],[2,12,2,35],[39,42,39,47]]}
[]
[null,null,null,null,null,null,null,null,null,null,null,null,"CENSO EDUCATIVO 2024"]
[null,null,null,null,null,null,null,null,null,null,null,null,"LOCAL EDUCATIVO"]
[]
[]
[]
[null,null,null,null,null,null,null,null,null,null,"SI REPORTÓ CONTAR CON AL MENOS UN ESPACIO DE TALLER PARA EDUCACIÓN PARA EL TRABAJO (EPT), ATIENDA LAS SIGUIENTES PREGUNTAS:"]
[null,null,null,null,null,null,null,null,null,null,null,"602. ¿LOS TALLERES PARA EL ÁREA DE EDUCACIÓN PARA EL TRABAJO CUENTAN CON EL EQUIPA-",null,null,null,null,null,null,null,null,null,null,null,null,null,"603. EL EQUIPAMIENTO DE LOS TALLERES PARA",null,null,null,null,null,null,null,null,null,null,null,null,"604. ¿SU INVENTARIO SE ENCUENTRA"]
[null,null,null,null,null,null,null,null,null,null,null,"MIENTO BÁSICO PARA EL DESARROLLO DE LA ESPECIALIDAD QUE OFERTA?",null,null,null,null,null,null,null,null,null,null,null,null,null,null," EL ÁREA DE EDUCACIÓN PARA EL TRABAJO,",null,null,null,null,null,null,null,null,null,null,null,null,"REGISTRADO EN LA UGEL?"]
[null,null,null,null,null,null,null,null,null,null,null,null,null,null,null,null,null,null,null,null,null,null,null,null,null,null," ¿SE ENCUENTRAN OPERATIVOS Y EN"]
[null,null,null,null,null,null,null,null,null,null,null,null,null,null,null,null,null,null,null,null,null,null,null,null,null,null," FUNCIONAMIENTO?",null,null,null,null,null,null,null,null,null,null,null,null,null,null,"Sí",null,null,null,null,"No"]
[]
[null,null,null,null,null,null,null,null,null,null,null,null,null,null,"Sí",null,null,null,null,null,"No",null,null,null,null,null,null,null,"Sí",null,null,null,null,null,"No"]
[]
[null,null,null,null,null,null,null,null,null,null,null,null,null,null,null,null,null,null,"Pase a la pregunta 605"]
[]
[null,null,null,null,null,null,null,null,null,null,"SI REPORTÓ CONTAR CON AL MENOS UN ESPACIO DESTINADO PARA COCINA, ATIENDA LAS SIGUIENTES PREGUNTAS:"]
[null,null,null,null,null,null,null,null,null,null,null,"605. ¿EN EL LOCAL EDUCATIVO SE BRINDA EL SERVICIO DE ALIMENTACIÓN ESCOLAR PROVISTO POR EL PNAE QALI WARMA?",null,null,null,null,null,null,null,null,null,null,null,null,null,null,null,null,null,null,null,"607. SOBRE EL ESPACIO DE COCINA, ESPECIFICAR:"]
[null,null,null,null,null,null,null,null,null,null,null,null,null,null,null,null,null,null,null,null,null,null,null,null,null,null,null,null,null,null,null,null,"La cocina cuenta con :",null,null,null,null,null,null,null,null,null,null,null,null,"Sí","No"]
[]
[null,null,null,null,null,null,null,null,null,null,null,null,null,null,"Sí",null,null,null,null,null,"No",null,null,null,"Pase a la pregunta 609",null,null,null,null,null,null,null,"1. ¿Zona previa (descongelación, corte, desinfección de ...)?"]
[null,null,null,null,null,null,null,null,null,null,null,null,null,null,null,null,null,null,null,null,null,null,null,null,null,null,null,null,null,null,null,null,"2. ¿Zona de preparación del alimento (cocina caliente, ...)?"]
[null,null,null,null,null,null,null,null,null,null,null,null,null,null,null,null,null,null,null,null,null,null,null,null,null,null,null,null,null,null,null,null,"3. ¿Zona de servido (servido en platos)?"]
[null,null,null,null,null,null,null,null,null,null,null,"606. ¿EL LOCAL EDUCATIVO CUENTA CON ESPACIO DE COCINA Y DE ALMACÉN PROVISTO POR EL PNAE QALI WARMA?",null,null,null,null,null,null,null,null,null,null,null,null,null,null,null,null,null,null,null,null,"4. ¿Zona de lavado de vajilla?"]
[]
[null,null,null,null,null,null,null,null,null,null,null,null,null,null,null,null,null,null,null,null,null,null,null,null,null,null,null,null,null,null,null,"608. SOBRE EL ESPACIO DE ALMACÉN ESPECIFICAR SI ¿CUENTA CON UN"]
[null,null,null,null,null,null,null,null,null,null,null,null,null,null,"Sí",null,null,null,null,null,"No",null,null,null,"Pase a la pregunta 609",null,null,null,null,null,null,null,"ESPACIO PARA LA RECEPCIÓN E INSPECCIÓN DE LOS ALIMENTOS E"]
[null,null,null,null,null,null,null,null,null,null,null,null,null,null,null,null,null,null,null,null,null,null,null,null,null,null,null,null,null,null,null,null,"INSUMOS, PREVIAMENTE AL INGRESO DEL ALMACÉN?"]
[null,null,null,null,null,null,null,null,null,null,null,null,null,{"$f":"CONCATENATE(N21,N27)","v":""},null,null,null,null,null,{"$f":"CONCATENATE(T21,T27)","v":""}]
[null,null,null,null,null,null,null,null,null,null,null,null,null,null,null,null,null,null,null,null,null,null,null,null,null,null,null,null,null,null,null,null,null,null,null,"Sí",null,null,null,null,null,"No"]
[]
[null,null,null,null,null,null,null,null,null,null,"SI REPORTÓ CONTAR CON AL MENOS UN ESPACIO DESTINADO PARA BIBLIOTECA, ATIENDA LAS SIGUIENTES PREGUNTAS:"]
[null,null,null,null,null,null,null,null,null,null,null,"609. EL LOCAL EDUCATIVO CUENTA CON UN ESPACIO DESIGNADO COMO BIBLIOTECA, QUE NO HA SIDO CONSTRUIDO",null,null,null,null,null,null,null,null,null,null,null,null,null,null,null,null,null,null,null,"610. ¿LA BIBLIOTECA ESTA FUNCIONANDO?"]
[null,null,null,null,null,null,null,null,null,null,null,"PARA USO EXCLUSIVO DE BIBLIOTECA?"]
[null,null,null,null,null,null,null,null,null,null,null,null,null,null,null,null,null,null,null,null,null,null,null,null,null,null,null,null,null,null,null,null,null,null,"Sí",null,null,null,null,"¿Indique el motivo principal?"]
[null,null,null,null,null,null,null,null,null,null,null,null,null,null,null,null,null,null,null,null,null,null,null,null,null,null,null,null,null,null,null,null,null,null,null,null,null,null,null,"Marque con una “X” solo una opción"]
[null,null,null,null,null,null,null,null,null,null,null,null,null,null,"Sí",null,null,null,null,null,"No",null,null,null,"Pase a la pregunta 611",null,null,null,null,null,null,null,null,null,null,null,null,null,null,null,"Por estar en reparación y/o mantenimiento"]
[null,null,null,null,null,null,null,null,null,null,null,null,null,null,null,null,null,null,null,null,null,null,null,null,null,null,null,null,null,null,null,null,null,null,"No",null,null,null,null,null,"Por falta de libros y/o mobiliario"]
[null,null,null,null,null,null,null,null,null,null,null,null,null,null,null,null,null,null,null,null,null,null,null,null,null,null,null,null,null,null,null,null,null,null,null,null,null,null,null,null,"En proyecto"]
[null,null,null,null,null,null,null,null,null,null,null,null,null,null,null,null,null,null,null,null,null,null,null,null,null,null,null,null,null,null,null,null,null,null,null,null,null,null,null,null,"Otro"]
[]
[null,null,null,null,null,null,null,null,null,null,"SI REPORTÓ CONTAR CON AL MENOS UN ESPACIO DESTINADO PARA LABORATORIO DE CIENCIAS, ATIENDA LA SIGUIENTE PREGUNTA:"]
[]
[null,null,null,null,null,null,null,null,null,null,null,null,"611. EL LOCAL EDUCATIVO CUENTA CON LABORATORIOS QUE UTILICEN SOLO INSUMOS QUÍMICOS?",null,null,null,null,null,null,null,null,null,null,null,null,null,null,null,null,null,null,null,null,null,null,null,null,"Sí",null,null,null,null,null,"No"]
[]
[null,null,null,null,null,null,null,null,null,null,"SOBRE ESPACIOS DESTINADOS PARA PROCESOS PRODUCTIVOS:"]
[null,null,null,null,null,null,null,null,null,null,null,null,"612. ¿EL LOCAL CUENTA CON INSTALACIONES DESTINADAS AL DESARROLLO DE AL MENOS UNO DE LOS SIGUIENTES PROCESOS PRODUCTIVOS:?"]
[]
[null,null,null,null,null,null,null,null,null,null,null,null,null,"(i) Actividades de acuicultura con una producción anual mayor a las 3.5 toneladas brutas."]
[null,null,null,null,null,null,null,null,null,null,null,null,null,"(ii) Beneficio animales considerando un número de individuos igual o mayor a 10 cabezas de ganado vacuno/día,"]
[null,null,null,null,null,null,null,null,null,null,null,null,null,null,"20 cabezas de cerdos o camélidos sudamericanos/día, 30 cabezas de ovino o caprino/día o su equivalente"]
[null,null,null,null,null,null,null,null,null,null,null,null,null,null,"a un consumo superior de 5000 litros de agua por día para otro tipo de animales."]
[null,null,null,null,null,null,null,null,null,null,null,null,null,"(iii) Acopio de leche fresca en plantas con una capacidad igual o mayor a 10 000 litros de leche por día."]
[]
[null,null,null,null,null,null,null,null,null,null,null,null,null,null,null,null,null,null,null,null,null,null,null,null,null,null,null,"Sí",null,null,null,null,null,"No"]
[]
[]
[null,null,null,null,null,null,null,null,null,null,"613. RESPECTO A LOS ESPACIOS DEPORTIVOS ABIERTOS Y ESPACIOS EXTERIORES/DE RELACIÓN CON LA NATURALEZA:"]
[]
[null,null,null,null,null,null,null,null,null,null,null,null,null,null,"CANTIDAD DE ESPACIOS DEPORTIVOS ABIERTOS Y ESPACIOS EXTERIORES"]
[]
[]
[null,null,null,null,null,null,null,null,null,null,null,"(1)","(2)","(3)\nNiveles educativos de la Educación Básica/ETP y/o Carreras/Programas de la Educación Superior que usan el ambiente\nMarque con una “X” los niveles y/o carreras/Programas de Educación Superior que utiliza el ambiente",null,null,null,null,null,null,null,null,null,null,null,null,null,null,null,null,null,null,null,null,null,null,null,null,null,null,null,null,null,null,null,null,null,"(4)","(5)",null,"(6)","(7)",null,null,"(8)"]
[null,null,null,null,null,null,null,null,null,null,null,"Detalle del espacio","El ambiente ¿Se encuentra en uso?",null,null,null,null,null,null,null,null,null,null,null,null,null,null,null,null,null,null,null,null,null,null,null,null,null,null,null,null,null,null,null,null,null,null,"¿Tiene\nforma\nde\ncuadri- látero?","Dimensiones de ambientes",null,"Estado de conserva- ción","Cubierta contra la radiación solar",null,null,"¿Cuénta con medidas reglamentarias?"]
[null,null,null,null,null,null,null,null,null,"Nº",null,null,null,"Niveles de la Educación Básica y ETP",null,null,null,null,null,null,null,null,null,null,null,null,null,"Carreras/Programas de la Educación Superior que usan el ambiente",null,null,null,null,null,null,null,null,null,null,null,null,null,null,null,null,null,null,null,null,"(1)\n\nLargo\n(m)","(2)\n\nAncho\n (m)",null,"(1)\n¿Cuenta con cubierta contra la radiación solar?","Tipo de cubierta"]
["Detalle del espacio","Dpx","Corr","NivB","NivS","Carr","Sup",null,null,null,"Código","Detalle",null,"A.","B0","F0","D1","D2","E0","E1","E2","L0","K0","T0","M0","P0","S0","Carrera 01","Carrera 02","Carrera 03","Carrera 04","Carrera 05","Carrera 06","Carrera 07","Carrera 08","Carrera 09","Carrera 10","Carrera 11","Carrera 12","Carrera 13","Carrera 14","Carrera 15","Carrera 16","Carrera 17","Carrera 18","Carrera 19","Carrera 20",null,null,null,null,null,"(2) \n\nMATERIAL","(3)\n\nALCANCE"]
["115: Losa multiuso tipo I 15 x 28",{"$f":"IF($K67<>\"\",COUNTIF($K$67:$K$96,$K67),0)","v":0},1,{"$f":"COUNTIF(N67:V67,\"X\")","v":0},{"$f":"COUNTIF(W67:AA67,\"X\")","v":0},{"$f":"COUNTIF(AB67:AU67,\"X\")","v":0},{"$f":"IF(E67>0,\"X\",\"\")","v":""},null,null,{"$f":"IF($C67<=$M$60,C67,\"\")","v":""},{"$f":"IF(L67<>\"\",LEFT(L67,3),\"\")","v":""},"","","","","","","","","","","","","","","","","","","","","","","","","","","","","","","","","","","","","","","","","","","","",""]
["116: Losa multiuso tipo II 20 x 40",{"$f":"IF($K68<>\"\",COUNTIF($K$67:$K$96,$K68),0)","v":0},2,{"$f":"COUNTIF(N68:V68,\"X\")","v":0},{"$f":"COUNTIF(W68:AA68,\"X\")","v":0},{"$f":"COUNTIF(AB68:AU68,\"X\")","v":0},{"$f":"IF(E68>0,\"X\",\"\")","v":""},null,null,"",{"$f":"IF(L68<>\"\",LEFT(L68,3),\"\")","v":""},"","","","","","","","","","","","","","","","","","","","","","","","","","","","","","","","","","","","","","","","","","","","",""]
["117: Pista de velocidad y saltos",{"$f":"IF($K69<>\"\",COUNTIF($K$67:$K$96,$K69),0)","v":0},3,0,0,0,"",null,null,"",{"$f":"IF(L69<>\"\",LEFT(L69,3),\"\")","v":""},"","","","","","","","","","","","","","","","","","","","","","","","","","","","","","","","","","","","","","","","","","","",""]
["118: Piscina semiolímpica sin techar",0,4,0,0,0,"",null,null,"","","","","","","","","","","","","","","","","","","","","","","","","","","","","","","","","","","","","","","","","","","","","",""]
["119: Piscina olímpica sin techar",0,5,0,0,0,"",null,null,"","","","","","","","","","","","","","","","","","","","","","","","","","","","","","","","","","","","","","","","","","","","","",""]
["120: Campo de fútbol y campo atlético",0,6,0,0,0,"",null,null,"","","","","","","","","","","","","","","","","","","","","","","","","","","","","","","","","","","","","","","","","","","","","",""]
["121: Solo campo de fútbol",0,7,0,0,0,"",null,null,"","","","","","","","","","","","","","","","","","","","","","","","","","","","","","","","","","","","","","","","","","","","","",""]
["122: Solo campo atlético",0,8,0,0,0,"",null,null,"","","","","","","","","","","","","","","","","","","","","","","","","","","","","","","","","","","","","","","","","","","","","",""]
["123: Otro espacio deportivo abierto",0,9,0,0,0,"",null,null,"","","","","","","","","","","","","","","","","","","","","","","","","","","","","","","","","","","","","","","","","","","","","",""]
["124: Área de ingreso ",0,10,0,0,0,"",null,null,"","","","","","","","","","","","","","","","","","","","","","","","","","","","","","","","","","","","","","","","","","","","","",""]
["125: Pasadizos y circulaciones",0,11,0,0,0,"",null,null,"","","","","","","","","","","","","","","","","","","","","","","","","","","","","","","","","","","","","","","","","","","","","",""]
["126: Patio",0,12,0,0,0,"",null,null,"","","","","","","","","","","","","","","","","","","","","","","","","","","","","","","","","","","","","","","","","","","","","",""]
["127: Área de recreación",0,13,0,0,0,"",null,null,"","","","","","","","","","","","","","","","","","","","","","","","","","","","","","","","","","","","","","","","","","","","","",""]
["128: Áreas verdes y jardínes",0,14,0,0,0,"",null,null,"","","","","","","","","","","","","","","","","","","","","","","","","","","","","","","","","","","","","","","","","","","","","",""]
["129: Espacio de cultivo",0,15,0,0,0,"",null,null,"","","","","","","","","","","","","","","","","","","","","","","","","","","","","","","","","","","","","","","","","","","","","",""]
["130: Espacio de crianza de animales",0,16,0,0,0,"",null,null,"","","","","","","","","","","","","","","","","","","","","","","","","","","","","","","","","","","","","","","","","","","","","",""]
["131: Tribuna / gradería",0,17,0,0,0,"",null,null,"","","","","","","","","","","","","","","","","","","","","","","","","","","","","","","","","","","","","","","","","","","","","",""]
["132: Otro espacio exterior y de relación",0,18,0,0,0,"",null,null,"","","","","","","","","","","","","","","","","","","","","","","","","","","","","","","","","","","","","","","","","","","","","",""]
[null,0,19,0,0,0,"",null,null,"","","","","","","","","","","","","","","","","","","","","","","","","","","","","","","","","","","","","","","","","","","","","",""]
["Tabla : Si, No",0,20,0,0,0,"",null,null,"","","","","","","","","","","","","","","","","","","","","","","","","","","","","","","","","","","","","","","","","","","","","",""]
["SI",0,21,0,0,0,"",null,null,"","","","","","","","","","","","","","","","","","","","","","","","","","","","","","","","","","","","","","","","","","","","","",""]
["NO",0,22,0,0,0,"",null,null,"","","","","","","","","","","","","","","","","","","","","","","","","","","","","","","","","","","","","","","","","","","","","",""]
[null,0,23,0,0,0,"",null,null,"","","","","","","","","","","","","","","","","","","","","","","","","","","","","","","","","","","","","","","","","","","","","",""]
["TABLA 05 - Estado",0,24,0,0,0,"",null,null,"","","","","","","","","","","","","","","","","","","","","","","","","","","","","","","","","","","","","","","","","","","","","",""]
["01: Bueno",0,25,0,0,0,"",null,null,"","","","","","","","","","","","","","","","","","","","","","","","","","","","","","","","","","","","","","","","","","","","","",""]
["02: Regular",0,26,0,0,0,"",null,null,"","","","","","","","","","","","","","","","","","","","","","","","","","","","","","","","","","","","","","","","","","","","","",""]
["03: Malo",0,27,0,0,0,"",null,null,"","","","","","","","","","","","","","","","","","","","","","","","","","","","","","","","","","","","","","","","","","","","","",""]
["04: Lo requiere",0,28,0,0,0,"",null,null,"","","","","","","","","","","","","","","","","","","","","","","","","","","","","","","","","","","","","","","","","","","","","",""]
["04: No requiere",0,29,0,0,0,"",null,null,"","","","","","","","","","","","","","","","","","","","","","","","","","","","","","","","","","","","","","","","","","","","","",""]
[null,0,30,0,0,0,"",null,null,"","","","","","","","","","","","","","","","","","","","","","","","","","","","","","","","","","","","","","","","","","","","","",""]
[null,null,31,null,null,null,null,null,null,"","","","","","","","","","","","","","","","","","","","","","","","","","","","","","","","","","","","","","","","","","","","","",""]
[]
["MATERIAL:",null,null,null,null,null,null,null,null,{"$f":"IF(M60>0,\"X\",\"\")","v":""},"SI REPORTÓ CONTAR CON AL MENOS UN ESPACIO DEPORTIVO YA SEA CERRADO O ABIERTO, ATIENDA LAS SIGUIENTES PREGUNTAS:"]
["01: Cubierta liviana",null,null,null,null,null,null,null,null,null,"614. ALGUNO DE LOS ESPACIOS DEPORTIVOS (YA SEAN CERRADOS O ABIERTOS), ¿SE ENCUENTRAN EN CONCESIÓN?"]
["02: Techo de calamina"]
["03: Otro",null,null,null,null,null,null,null,null,null,null,null,null,"","Sí",null,null,null,null,null,"No"]
[]
["MATERIAL:",null,null,null,null,null,null,null,null,null,"615. ALGUNO DE LOS ESPACIOS DEPORTIVOS (YA SEAN CERRADOS O ABIERTOS), ¿SE ENCUENTRA OCUPADO POR ALGUNA INFRAESTRUCTURA PORTÁTIL, U OTRO?"]
["01: Total"]
["02: Parcial",null,null,null,null,null,null,null,null,null,null,null,null,"","Sí",null,null,"Especifique"]
[]
[null,null,null,null,null,null,null,null,null,null,null,null,null,null,"No"]
[null,null,null,null,null,null,null,null,null,null,null,null,null,null,null,null,null,null,null,null,null,null,null,null,null,null,null,"1. Arcos - Fútbol"]
["Tabla : Si, No, No aplica",null,null,null,null,null,null,null,null,null,"616. AL MENOS UNO DE LOS ESPACIOS DEPORTIVOS (YA SEAN CERRADOS O ABIERTOS), ¿CUENTA CON",null,null,null,null,null,null,null,null,null,null,null,null,null,null,null,null,"2. Arcos con mallas - Fútbol"]
["01: SI",null,null,null,null,null,null,null,null,null,"EL SIGUIENTE EQUIPAMIENTO DEPORTIVO?",null,"Marque con una “X” una ó más alternativa",null,null,null,null,null,null,null,null,null,null,null,null,null,null,"3. Tableros con aros - Baloncesto"]
["02: NO",null,null,null,null,null,null,null,null,null,null,null,null,null,null,null,null,null,null,null,null,null,null,null,null,null,null,"4. Aro y malla - Baloncesto"]
["03: No Aplica",null,null,null,null,null,null,null,null,null,null,null,null,null,null,null,null,null,null,null,null,null,null,null,null,null,null,"5. Parantes - Vóley"]
[null,null,null,null,null,null,null,null,null,null,null,null,null,null,null,null,null,null,null,null,null,null,null,null,null,null,null,"6. Net - Vóley"]
[null,null,null,null,null,null,null,null,null,null,null,null,null,null,null,null,null,null,null,null,null,null,null,null,null,null,null,"7. Ninguno de los anteriores"]

{"sheet":"S700","index":10,"n_rows":99,"n_cols":77,"rows_kept":99,"cut":false,"hidden":false,"merged":[[13,32,15,32],[13,33,15,33],[12,26,12,33],[14,40,15,40],[12,35,12,36],[12,37,12,38],[12,39,12,40],[13,35,13,36],[13,37,13,38],[13,39,13,40],[14,35,15,35],[14,36,15,36],[14,37,15,37],[14,38,15,38],[14,39,15,39],[12,46,12,52],[12,53,12,62],[12,41,12,45],[13,49,13,51],[12,63,12,74],[13,41,13,42],[13,52,15,52],[13,58,13,62],[14,58,14,59],[13,43,13,45],[14,55,14,57],[13,53,13,57],[14,53,14,54],[13,47,13,48],[13,46,15,46],[12,76,15,76],[12,75,15,75],[14,68,15,68],[14,71,14,73],[14,60,14,62],[14,74,15,74],[13,69,13,74],[14,69,14,70],[14,63,14,64],[13,63,13,68],[14,65,14,67],[12,11,12,24],[1,10,1,29],[2,10,2,29],[6,7,6,30],[13,34,14,34],[13,27,15,27],[13,28,15,28],[13,29,15,29],[13,30,15,30],[13,31,15,31],[13,25,15,25],[14,8,15,8],[14,9,15,9],[14,11,14,24],[13,11,13,24],[13,26,15,26]]}
[null,null,null,null,null,{"$f":"IF('S400'!G19<>\"\",'S400'!G19,\"X\")","v":"X"}]
[null,null,null,null,null,{"$f":"IF('S400'!G20<>\"\",'S400'!G20,\"X\")","v":"X"},null,null,null,null,"CENSO EDUCATIVO 2024"]
[null,null,null,null,null,{"$f":"IF('S400'!G21<>\"\",'S400'!G21,\"X\")","v":"X"},null,null,null,null,"LOCAL EDUCATIVO"]
[null,null,null,null,null,{"$f":"IF('S400'!G22<>\"\",'S400'!G22,\"X\")","v":"X"}]
[null,null,null,null,null,{"$f":"IF('S400'!G23<>\"\",'S400'!G23,\"X\")","v":"X"}]
[null,null,null,null,null,{"$f":"IF('S400'!G24<>\"\",'S400'!G24,\"X\")","v":"X"}]
[null,null,null,null,null,{"$f":"IF('S400'!G25<>\"\",'S400'!G25,\"X\")","v":"X"},null,"700. CARACTERÍSTICAS DE ESPACIOS USADOS COMO SERVICIOS HIGIÉNICOS EN EL LOCAL EDUCATIVO [Solo para la gestión Pública]"]
[null,null,null,null,null,{"$f":"IF('S400'!G26<>\"\",'S400'!G26,\"X\")","v":"X"}]
[null,null,null,null,null,{"$f":"IF('S400'!G27<>\"\",'S400'!G27,\"X\")","v":"X"}]
[null,null,null,null,null,{"$f":"IF('S400'!G28<>\"\",'S400'!G28,\"X\")","v":"X"},null,null,null,null,"701. CANTIDAD DE ESPACIOS USADOS COMO SERVICIOS HIGIÉNICOS"]
[null,null,null,null,null,{"$f":"IF('S400'!G29<>\"\",'S400'!G29,\"X\")","v":"X"}]
[null,null,null,null,null,{"$f":"IF('S400'!G30<>\"\",'S400'!G30,\"X\")","v":"X"}]
[null,null,null,null,null,{"$f":"IF('S400'!G31<>\"\",'S400'!G31,\"X\")","v":"X"},null,null,"(1)","(2)","(3)","(4)",null,null,null,null,null,null,null,null,null,null,null,null,null,"(5)","(6)\nCaracterísticas de los servicios higiénicos para una persona\ncon silla de ruedas",null,null,null,null,null,null,null,"(7)","(8)",null,"(9)",null,"(10)",null,"(11)\nSobre las letrinas en los SS.HH.",null,null,null,null,"(12)\nSobre los inodoros y/o water en los SSHH",null,null,null,null,null,null,"(13)\nSobre los lavatorios o lavamanos en los SSHH",null,null,null,null,null,null,null,null,null,"(14)\nSobre los urinarios en los SSHH",null,null,null,null,null,null,null,null,null,null,null,"(15)\n\nEl espacio de SSHH o vestidor, ¿Se encuentra habilitado con duchas operativas?","(16)\n\n¿Se dispone de agua caliente en el espacio de SSHH o vestidor?"]
[null,null,null,null,null,{"$f":"IF('S400'!G32<>\"\",'S400'!G32,\"X\")","v":"X"},null,null,null,null,null,"Niveles educativos que usan el ambiente",null,null,null,null,null,null,null,null,null,null,null,null,null,"¿Los SS.HH. están habilitados para personas con discapa- cidad?","(1)\n\n¿La puerta de\nacceso tiene\nun ancho libre\nmínimo\nde 1.00 m.??","(2)\n\n¿El cubículo del inodoro tiene un área con diámetro de 1.50 m. para el giro de una silla de ruedas en 360°?","(3)\n\n¿Existe un espacio libre de 0.75 m. x 1.20 m. al frente de cada aparato sanitario para una persona en silla de ruedas?","(4)\n\n¿El cubiculo para el inodoro mide, como minimo, 1.50 m. x 2.00 m.?","(5)\n\n¿La ubicación de los aparatos sanitarios respeta el espacio del diámetro de giro de 1.50 m. sin incluir el radio de giro de la puerta?","(6)\n\n¿Cuentan\ncon\nbarras de\napoyo?","(7)\n\nCantidad de inodoros o water habilitados para una persona con discapacidad","(8)\n\nCantidad de lavatorios o lavamanos habilitados para una persona con discapacidad","El ámbiente de SS.HH.\nes usado por:","Paredes",null,"Techo",null,"Piso",null,"Cantidad de letrinas",null,"Letrinas operativas según estado de conservación",null,null,"(1)\n\nEl diseño y finalidad de uso de los inodoros y/o water de este ambiente es para:","Cantidad de inodoros y/o water",null,"Cantidad de inodoros y/o water operativos según estado de conservación",null,null,"(7)\n\nDel total operativos ¿cuántos tienen función de descarga?","INDIVIDUALES",null,null,null,null,"CORRIDOS",null,null,null,null,"Urinarios INDIVIDUALES",null,null,null,null,null,"Urinarios CORRIDOS"]
[null,null,null,null,null,{"$f":"IF('S400'!G33<>\"\",'S400'!G33,\"X\")","v":"X"},null,"Nº","Nº de edifica- ción","Nº de piso","Detalle del ambiente usado como Servicio Higiénico","(Marque con una “X”)",null,null,null,null,null,null,null,null,null,null,null,null,null,null,null,null,null,null,null,null,null,null,null,"(1)\n\nMaterial\npredominante","(2)\n\nEstado de conserva-\nción","(1)\n\nMaterial\npredominante","(2)\n\nEstado de conserva-\nción","(1)\n\nMaterial\npredominante","(2)\n\nEstado de conserva-\nción","(1)","(2)","(3)","(4)","(5)",null,"(2)","(3)","(4)","(5)","(6)",null,"Cantidad",null,"Cantidad según estado de conservación",null,null,"Cantidad",null,"Cantidad según estado de conservación",null,null,"Cantidad",null,"Cantidad según estado de conservación",null,null,"(6)\nDel total operativos ¿cuántos tienen función de descarga?","Cantidad",null,"Cantidad según estado de conservación",null,null,"(6)\nDel total operativos ¿cuántos tienen función de descarga?"]
[null,"Corr","Niv",null,null,{"$f":"IF('S400'!G34<>\"\",'S400'!G34,\"X\")","v":"X"},null,null,null,null,null,"A.","B0","F0","D1","D2","E0","E1","E2","L0","K0","T0","M0","P0","S0",null,null,null,null,null,null,null,null,null,null,null,null,null,null,null,null,"Total","Opera-\ntivas","Buen estado","Regular estado","Mal estado",null,"Total","Opera-\ntivas","Buen estado","Regular estado","Mal estado",null,"(1)\nTotal","(2)\nOpera-\ntivas","(3)\nBuen estado","(4)\nRegular estado","(5)\nMal estado","(1)\nTotal","(2)\nOpera-\ntivas","(3)\nBuen estado","(4)\nRegular estado","(5)\nMal estado","(1)\nTotal","(2)\nOpera-\ntivas","(3)\nBuen estado","(4)\nRegular estado","(5)\nMal estado",null,"(1)\nTotal","(2)\nOpera-\ntivas","(3)\nBuen estado","(4)\nRegular estado","(5)\nMal estado"]
["TABLA - Espacios",1,{"$f":"COUNTIF(L17:Y17,\"X\")","v":0},{"$f":"IF($E17<>\"\",COUNTIF($E$17:$E$96,$E17),0)","v":0},{"$f":"CONCATENATE(I17,J17,LEFT(K17,3))","v":""},{"$f":"IF('S400'!G35<>\"\",'S400'!G35,\"X\")","v":"X"},null,{"$f":"IF(B17<=$Z$10,B17,\"\")","v":""},"","","","","","","","","","","","","","","","","","","","","","","","","","","","","","","","","","","","","","","","","","","","","","","","","","","","","","","","","","","","","","","","","","","","",""]
["133: SSHH para Estudiantes",2,{"$f":"COUNTIF(L18:Y18,\"X\")","v":0},{"$f":"IF($E18<>\"\",COUNTIF($E$17:$E$96,$E18),0)","v":0},{"$f":"CONCATENATE(I18,J18,LEFT(K18,3))","v":""},{"$f":"IF('S400'!G36<>\"\",'S400'!G36,\"X\")","v":"X"},null,"","","","","","","","","","","","","","","","","","","","","","","","","","","","","","","","","","","","","","","","","","","","","","","","","","","","","","","","","","","","","","","","","","","","","",""]
["134: SSHH para Docentes",3,{"$f":"COUNTIF(L19:Y19,\"X\")","v":0},{"$f":"IF($E19<>\"\",COUNTIF($E$17:$E$96,$E19),0)","v":0},"",{"$f":"IF('S400'!G37<>\"\",'S400'!G37,\"X\")","v":"X"},null,"","","","","","","","","","","","","","","","","","","","","","","","","","","","","","","","","","","","","","","","","","","","","","","","","","","","","","","","","","","","","","","","","","","","","",""]
["135: SSHH para Administrativos",4,0,0,"",{"$f":"IF('S400'!G38<>\"\",'S400'!G38,\"X\")","v":"X"},null,"","","","","","","","","","","","","","","","","","","","","","","","","","","","","","","","","","","","","","","","","","","","","","","","","","","","","","","","","","","","","","","","","","","","","",""]
["136: SSHH para Estud. y Docentes",5,0,0,"",{"$f":"IF('S400'!G39<>\"\",'S400'!G39,\"X\")","v":"X"},null,"","","","","","","","","","","","","","","","","","","","","","","","","","","","","","","","","","","","","","","","","","","","","","","","","","","","","","","","","","","","","","","","","","","","","",""]
["137: SSHH para Estud. y Administ.",6,0,0,"",{"$f":"IF('S400'!G40<>\"\",'S400'!G40,\"X\")","v":"X"},null,"","","","","","","","","","","","","","","","","","","","","","","","","","","","","","","","","","","","","","","","","","","","","","","","","","","","","","","","","","","","","","","","","","","","","",""]
["138: SSHH para Estud.Docent.Admin.",7,0,0,"",{"$f":"IF('S400'!G41<>\"\",'S400'!G41,\"X\")","v":"X"},null,"","","","","","","","","","","","","","","","","","","","","","","","","","","","","","","","","","","","","","","","","","","","","","","","","","","","","","","","","","","","","","","","","","","","","",""]
["139: SSHH para Docentes y Administ.",8,0,0,"",{"$f":"IF('S400'!G42<>\"\",'S400'!G42,\"X\")","v":"X"},null,"","","","","","","","","","","","","","","","","","","","","","","","","","","","","","","","","","","","","","","","","","","","","","","","","","","","","","","","","","","","","","","","","","","","","",""]
["140: Vestidores para estudiantes",9,0,0,"",{"$f":"IF('S400'!G43<>\"\",'S400'!G43,\"X\")","v":"X"},null,"","","","","","","","","","","","","","","","","","","","","","","","","","","","","","","","","","","","","","","","","","","","","","","","","","","","","","","","","","","","","","","","","","","","","",""]
["141: Vestidores para Docnet.Administ.",10,0,0,"",{"$f":"IF('S400'!G44<>\"\",'S400'!G44,\"X\")","v":"X"},null,"","","","","","","","","","","","","","","","","","","","","","","","","","","","","","","","","","","","","","","","","","","","","","","","","","","","","","","","","","","","","","","","","","","","","",""]
["Tabla : Si, No",11,0,0,"",{"$f":"IF('S400'!G45<>\"\",'S400'!G45,\"X\")","v":"X"},null,"","","","","","","","","","","","","","","","","","","","","","","","","","","","","","","","","","","","","","","","","","","","","","","","","","","","","","","","","","","","","","","","","","","","","",""]
["SI",12,0,0,"",{"$f":"IF('S400'!G46<>\"\",'S400'!G46,\"X\")","v":"X"},null,"","","","","","","","","","","","","","","","","","","","","","","","","","","","","","","","","","","","","","","","","","","","","","","","","","","","","","","","","","","","","","","","","","","","","",""]
["NO",13,0,0,"",{"$f":"IF('S400'!G47<>\"\",'S400'!G47,\"X\")","v":"X"},null,"","","","","","","","","","","","","","","","","","","","","","","","","","","","","","","","","","","","","","","","","","","","","","","","","","","","","","","","","","","","","","","","","","","","","",""]
[null,14,0,0,"",{"$f":"IF('S400'!G48<>\"\",'S400'!G48,\"X\")","v":"X"},null,"","","","","","","","","","","","","","","","","","","","","","","","","","","","","","","","","","","","","","","","","","","","","","","","","","","","","","","","","","","","","","","","","","","","","",""]
["TABLA",15,0,0,"",{"$f":"IF('S400'!G49<>\"\",'S400'!G49,\"X\")","v":"X"},null,"","","","","","","","","","","","","","","","","","","","","","","","","","","","","","","","","","","","","","","","","","","","","","","","","","","","","","","","","","","","","","","","","","","","","",""]
["01: Sólo estudiantes",16,0,0,"",{"$f":"IF('S400'!G50<>\"\",'S400'!G50,\"X\")","v":"X"},null,"","","","","","","","","","","","","","","","","","","","","","","","","","","","","","","","","","","","","","","","","","","","","","","","","","","","","","","","","","","","","","","","","","","","","",""]
["02: Docentes y administrativos",17,0,0,"",{"$f":"IF('S400'!G51<>\"\",'S400'!G51,\"X\")","v":"X"},null,"","","","","","","","","","","","","","","","","","","","","","","","","","","","","","","","","","","","","","","","","","","","","","","","","","","","","","","","","","","","","","","","","","","","","",""]
["03: Estudiantes y Docentes",18,0,0,"",{"$f":"IF('S400'!G52<>\"\",'S400'!G52,\"X\")","v":"X"},null,"","","","","","","","","","","","","","","","","","","","","","","","","","","","","","","","","","","","","","","","","","","","","","","","","","","","","","","","","","","","","","","","","","","","","",""]
["04: Otros adultos",19,0,0,"",{"$f":"IF('S400'!G53<>\"\",'S400'!G53,\"X\")","v":"X"},null,"","","","","","","","","","","","","","","","","","","","","","","","","","","","","","","","","","","","","","","","","","","","","","","","","","","","","","","","","","","","","","","","","","","","","",""]
["05: Ninguno",20,0,0,"",{"$f":"IF('S400'!G54<>\"\",'S400'!G54,\"X\")","v":"X"},null,"","","","","","","","","","","","","","","","","","","","","","","","","","","","","","","","","","","","","","","","","","","","","","","","","","","","","","","","","","","","","","","","","","","","","",""]
[null,21,0,0,"",{"$f":"IF('S400'!G55<>\"\",'S400'!G55,\"X\")","v":"X"},null,"","","","","","","","","","","","","","","","","","","","","","","","","","","","","","","","","","","","","","","","","","","","","","","","","","","","","","","","","","","","","","","","","","","","","",""]
["TABLA",22,0,0,"",{"$f":"IF('S400'!G56<>\"\",'S400'!G56,\"X\")","v":"X"},null,"","","","","","","","","","","","","","","","","","","","","","","","","","","","","","","","","","","","","","","","","","","","","","","","","","","","","","","","","","","","","","","","","","","","","",""]
["01: Sólo hombres",23,0,0,"",{"$f":"IF('S400'!G57<>\"\",'S400'!G57,\"X\")","v":"X"},null,"","","","","","","","","","","","","","","","","","","","","","","","","","","","","","","","","","","","","","","","","","","","","","","","","","","","","","","","","","","","","","","","","","","","","",""]
["02: Sólo mujeres",24,0,0,"",{"$f":"IF('S400'!G58<>\"\",'S400'!G58,\"X\")","v":"X"},null,"","","","","","","","","","","","","","","","","","","","","","","","","","","","","","","","","","","","","","","","","","","","","","","","","","","","","","","","","","","","","","","","","","","","","",""]
["03: Mixto",25,0,0,"",{"$f":"IF('S400'!G59<>\"\",'S400'!G59,\"X\")","v":"X"},null,"","","","","","","","","","","","","","","","","","","","","","","","","","","","","","","","","","","","","","","","","","","","","","","","","","","","","","","","","","","","","","","","","","","","","",""]
[null,26,0,0,"",{"$f":"IF('S400'!G60<>\"\",'S400'!G60,\"X\")","v":"X"},null,"","","","","","","","","","","","","","","","","","","","","","","","","","","","","","","","","","","","","","","","","","","","","","","","","","","","","","","","","","","","","","","","","","","","","",""]
["Tabla 01",27,0,0,"",{"$f":"IF('S400'!G61<>\"\",'S400'!G61,\"X\")","v":"X"},null,"","","","","","","","","","","","","","","","","","","","","","","","","","","","","","","","","","","","","","","","","","","","","","","","","","","","","","","","","","","","","","","","","","","","","",""]
["01: Ladrillo o concreto",28,0,0,"",{"$f":"IF('S400'!G62<>\"\",'S400'!G62,\"X\")","v":"X"},null,"","","","","","","","","","","","","","","","","","","","","","","","","","","","","","","","","","","","","","","","","","","","","","","","","","","","","","","","","","","","","","","","","","","","","",""]
["02: Adobe o tapial",29,0,0,"",{"$f":"IF('S400'!G63<>\"\",'S400'!G63,\"X\")","v":"X"},null,"","","","","","","","","","","","","","","","","","","","","","","","","","","","","","","","","","","","","","","","","","","","","","","","","","","","","","","","","","","","","","","","","","","","","",""]
["03: Quincha",30,0,0,"",{"$f":"IF('S400'!G64<>\"\",'S400'!G64,\"X\")","v":"X"},null,"","","","","","","","","","","","","","","","","","","","","","","","","","","","","","","","","","","","","","","","","","","","","","","","","","","","","","","","","","","","","","","","","","","","","",""]
["04: Piedra con barro o cemento",31,0,0,"",{"$f":"IF('S400'!G65<>\"\",'S400'!G65,\"X\")","v":"X"},null,"","","","","","","","","","","","","","","","","","","","","","","","","","","","","","","","","","","","","","","","","","","","","","","","","","","","","","","","","","","","","","","","","","","","","",""]
["05: Madera",32,0,0,"",{"$f":"IF('S400'!G66<>\"\",'S400'!G66,\"X\")","v":"X"},null,"","","","","","","","","","","","","","","","","","","","","","","","","","","","","","","","","","","","","","","","","","","","","","","","","","","","","","","","","","","","","","","","","","","","","",""]
["06: Triplay",33,0,0,"",{"$f":"IF('S400'!G67<>\"\",'S400'!G67,\"X\")","v":"X"},null,{"$f":"IF(B49<=$Z$10,B49,\"\")","v":""},"","","","","","","","","","","","","","","","","","","","","","","","","","","","","","","","","","","","","","","","","","","","","","","","","","","","","","","","","","","","","","","","","","","","",""]
["07: Eternit o fibra concreto",34,0,0,"",{"$f":"IF('S400'!G68<>\"\",'S400'!G68,\"X\")","v":"X"},null,"","","","","","","","","","","","","","","","","","","","","","","","","","","","","","","","","","","","","","","","","","","","","","","","","","","","","","","","","","","","","","","","","","","","","",""]
["08: Estera, cartón o plástico",35,0,0,"",{"$f":"IF('S400'!G69<>\"\",'S400'!G69,\"X\")","v":"X"},null,"","","","","","","","","","","","","","","","","","","","","","","","","","","","","","","","","","","","","","","","","","","","","","","","","","","","","","","","","","","","","","","","","","","","","",""]
["09: Otro",36,0,0,"",{"$f":"IF('S400'!G70<>\"\",'S400'!G70,\"X\")","v":"X"},null,"","","","","","","","","","","","","","","","","","","","","","","","","","","","","","","","","","","","","","","","","","","","","","","","","","","","","","","","","","","","","","","","","","","","","",""]
["10: NT. pero lo requiere",37,0,0,"",{"$f":"IF('S400'!G71<>\"\",'S400'!G71,\"X\")","v":"X"},null,"","","","","","","","","","","","","","","","","","","","","","","","","","","","","","","","","","","","","","","","","","","","","","","","","","","","","","","","","","","","","","","","","","","","","",""]
["11: NT. y no lo requiere",38,0,0,"",{"$f":"IF('S400'!G72<>\"\",'S400'!G72,\"X\")","v":"X"},null,"","","","","","","","","","","","","","","","","","","","","","","","","","","","","","","","","","","","","","","","","","","","","","","","","","","","","","","","","","","","","","","","","","","","","",""]
[null,39,0,0,"",{"$f":"IF('S400'!G73<>\"\",'S400'!G73,\"X\")","v":"X"},null,"","","","","","","","","","","","","","","","","","","","","","","","","","","","","","","","","","","","","","","","","","","","","","","","","","","","","","","","","","","","","","","","","","","","","",""]
["Tabla 02 ",40,0,0,"",{"$f":"IF('S400'!G74<>\"\",'S400'!G74,\"X\")","v":"X"},null,"","","","","","","","","","","","","","","","","","","","","","","","","","","","","","","","","","","","","","","","","","","","","","","","","","","","","","","","","","","","","","","","","","","","","",""]
["01: Bueno",41,0,0,"",{"$f":"IF('S400'!G75<>\"\",'S400'!G75,\"X\")","v":"X"},null,"","","","","","","","","","","","","","","","","","","","","","","","","","","","","","","","","","","","","","","","","","","","","","","","","","","","","","","","","","","","","","","","","","","","","",""]
["02: Regular",42,0,0,"",{"$f":"IF('S400'!G76<>\"\",'S400'!G76,\"X\")","v":"X"},null,"","","","","","","","","","","","","","","","","","","","","","","","","","","","","","","","","","","","","","","","","","","","","","","","","","","","","","","","","","","","","","","","","","","","","",""]
["03: Malo",43,0,0,"",{"$f":"IF('S400'!G77<>\"\",'S400'!G77,\"X\")","v":"X"},null,"","","","","","","","","","","","","","","","","","","","","","","","","","","","","","","","","","","","","","","","","","","","","","","","","","","","","","","","","","","","","","","","","","","","","",""]
["04: No aplica",44,0,0,"",{"$f":"IF('S400'!G78<>\"\",'S400'!G78,\"X\")","v":"X"},null,"","","","","","","","","","","","","","","","","","","","","","","","","","","","","","","","","","","","","","","","","","","","","","","","","","","","","","","","","","","","","","","","","","","","","",""]
[null,45,0,0,"",{"$f":"IF('S400'!G79<>\"\",'S400'!G79,\"X\")","v":"X"},null,"","","","","","","","","","","","","","","","","","","","","","","","","","","","","","","","","","","","","","","","","","","","","","","","","","","","","","","","","","","","","","","","","","","","","",""]
["Tabla 03 ",46,0,0,"",{"$f":"IF('S400'!G80<>\"\",'S400'!G80,\"X\")","v":"X"},null,"","","","","","","","","","","","","","","","","","","","","","","","","","","","","","","","","","","","","","","","","","","","","","","","","","","","","","","","","","","","","","","","","","","","","",""]
["01: Concreto armado",47,0,0,"",{"$f":"IF('S400'!G81<>\"\",'S400'!G81,\"X\")","v":"X"},null,"","","","","","","","","","","","","","","","","","","","","","","","","","","","","","","","","","","","","","","","","","","","","","","","","","","","","","","","","","","","","","","","","","","","","",""]
["02: Madera",48,0,0,"",{"$f":"IF('S400'!G82<>\"\",'S400'!G82,\"X\")","v":"X"},null,"","","","","","","","","","","","","","","","","","","","","","","","","","","","","","","","","","","","","","","","","","","","","","","","","","","","","","","","","","","","","","","","","","","","","",""]
["03: Teja",49,0,0,"",{"$f":"IF('S400'!G83<>\"\",'S400'!G83,\"X\")","v":"X"},null,"","","","","","","","","","","","","","","","","","","","","","","","","","","","","","","","","","","","","","","","","","","","","","","","","","","","","","","","","","","","","","","","","","","","","",""]
["04: Fibra de cemento",50,0,0,"",{"$f":"IF('S400'!G84<>\"\",'S400'!G84,\"X\")","v":"X"},null,"","","","","","","","","","","","","","","","","","","","","","","","","","","","","","","","","","","","","","","","","","","","","","","","","","","","","","","","","","","","","","","","","","","","","",""]
["05: Calamina",51,0,0,"",{"$f":"IF('S400'!G85<>\"\",'S400'!G85,\"X\")","v":"X"},null,"","","","","","","","","","","","","","","","","","","","","","","","","","","","","","","","","","","","","","","","","","","","","","","","","","","","","","","","","","","","","","","","","","","","","",""]
["06: Calaminon",52,0,0,"",{"$f":"IF('S400'!G86<>\"\",'S400'!G86,\"X\")","v":"X"},null,"","","","","","","","","","","","","","","","","","","","","","","","","","","","","","","","","","","","","","","","","","","","","","","","","","","","","","","","","","","","","","","","","","","","","",""]
["07: Eternit",53,0,0,"",{"$f":"IF('S400'!G87<>\"\",'S400'!G87,\"X\")","v":"X"},null,"","","","","","","","","","","","","","","","","","","","","","","","","","","","","","","","","","","","","","","","","","","","","","","","","","","","","","","","","","","","","","","","","","","","","",""]
["08: Caña con barro",54,0,0,"",{"$f":"IF('S400'!G88<>\"\",'S400'!G88,\"X\")","v":"X"},null,"","","","","","","","","","","","","","","","","","","","","","","","","","","","","","","","","","","","","","","","","","","","","","","","","","","","","","","","","","","","","","","","","","","","","",""]
["09: Lata o latón",55,0,0,"",{"$f":"IF('S400'!G89<>\"\",'S400'!G89,\"X\")","v":"X"},null,"","","","","","","","","","","","","","","","","","","","","","","","","","","","","","","","","","","","","","","","","","","","","","","","","","","","","","","","","","","","","","","","","","","","","",""]
["10: Otro",56,0,0,"",{"$f":"IF('S400'!G90<>\"\",'S400'!G90,\"X\")","v":"X"},null,"","","","","","","","","","","","","","","","","","","","","","","","","","","","","","","","","","","","","","","","","","","","","","","","","","","","","","","","","","","","","","","","","","","","","",""]
["11: NT. pero lo requiere",57,0,0,"",{"$f":"IF('S400'!G91<>\"\",'S400'!G91,\"X\")","v":"X"},null,"","","","","","","","","","","","","","","","","","","","","","","","","","","","","","","","","","","","","","","","","","","","","","","","","","","","","","","","","","","","","","","","","","","","","",""]
["12: NT. y no lo requiere",58,0,0,"",{"$f":"IF('S400'!G92<>\"\",'S400'!G92,\"X\")","v":"X"},null,"","","","","","","","","","","","","","","","","","","","","","","","","","","","","","","","","","","","","","","","","","","","","","","","","","","","","","","","","","","","","","","","","","","","","",""]
[null,59,0,0,"",{"$f":"IF('S400'!G93<>\"\",'S400'!G93,\"X\")","v":"X"},null,"","","","","","","","","","","","","","","","","","","","","","","","","","","","","","","","","","","","","","","","","","","","","","","","","","","","","","","","","","","","","","","","","","","","","",""]
["Tabla 04",60,0,0,"",{"$f":"IF('S400'!G94<>\"\",'S400'!G94,\"X\")","v":"X"},null,"","","","","","","","","","","","","","","","","","","","","","","","","","","","","","","","","","","","","","","","","","","","","","","","","","","","","","","","","","","","","","","","","","","","","",""]
["01: Parquet o madera pulida",61,{"$f":"COUNTIF(L77:Y77,\"X\")","v":0},0,null,{"$f":"IF('S400'!G95<>\"\",'S400'!G95,\"X\")","v":"X"},null,"","","","","","","","","","","","","","","","","","","","","","","","","","","","","","","","","","","","","","","","","","","","","","","","","","","","","","","","","","","","","","","","","","","","","",""]
["02: Vinilico, pisopak o similar",62,0,0,null,{"$f":"IF('S400'!G96<>\"\",'S400'!G96,\"X\")","v":"X"},null,"","","","","","","","","","","","","","","","","","","","","","","","","","","","","","","","","","","","","","","","","","","","","","","","","","","","","","","","","","","","","","","","","","","","","",""]
["03: Loseta, cerámico o similar",63,0,0,null,{"$f":"IF('S400'!G97<>\"\",'S400'!G97,\"X\")","v":"X"},null,"","","","","","","","","","","","","","","","","","","","","","","","","","","","","","","","","","","","","","","","","","","","","","","","","","","","","","","","","","","","","","","","","","","","","",""]
["04: Cemento",64,0,0,null,{"$f":"IF('S400'!G98<>\"\",'S400'!G98,\"X\")","v":"X"},null,"","","","","","","","","","","","","","","","","","","","","","","","","","","","","","","","","","","","","","","","","","","","","","","","","","","","","","","","","","","","","","","","","","","","","",""]
["05: Madera entablado",65,0,0,null,{"$f":"IF('S400'!G99<>\"\",'S400'!G99,\"X\")","v":"X"},null,"","","","","","","","","","","","","","","","","","","","","","","","","","","","","","","","","","","","","","","","","","","","","","","","","","","","","","","","","","","","","","","","","","","","","",""]
["06: Tierra",66,0,0,null,{"$f":"IF('S400'!G100<>\"\",'S400'!G100,\"X\")","v":"X"},null,"","","","","","","","","","","","","","","","","","","","","","","","","","","","","","","","","","","","","","","","","","","","","","","","","","","","","","","","","","","","","","","","","","","","","",""]
["07: Otro",67,0,{"$f":"IF($E83<>\"\",COUNTIF($E$17:$E$96,$E83),0)","v":0},null,{"$f":"IF('S400'!G101<>\"\",'S400'!G101,\"X\")","v":"X"},null,"","","","","","","","","","","","","","","","","","","","","","","","","","","","","","","","","","","","","","","","","","","","","","","","","","","","","","","","","","","","","","","","","","","","","",""]
["08: NT. pero lo requiere",68,0,0,null,{"$f":"IF('S400'!G102<>\"\",'S400'!G102,\"X\")","v":"X"},null,"","","","","","","","","","","","","","","","","","","","","","","","","","","","","","","","","","","","","","","","","","","","","","","","","","","","","","","","","","","","","","","","","","","","","",""]
["09: NT. y no lo requiere",69,0,0,null,{"$f":"IF('S400'!G103<>\"\",'S400'!G103,\"X\")","v":"X"},null,"","","","","","","","","","","","","","","","","","","","","","","","","","","","","","","","","","","","","","","","","","","","","","","","","","","","","","","","","","","","","","","","","","","","","",""]
[null,70,0,0,null,{"$f":"IF('S400'!G104<>\"\",'S400'!G104,\"X\")","v":"X"},null,"","","","","","","","","","","","","","","","","","","","","","","","","","","","","","","","","","","","","","","","","","","","","","","","","","","","","","","","","","","","","","","","","","","","","",""]
[null,71,0,0,null,{"$f":"IF('S400'!G105<>\"\",'S400'!G105,\"X\")","v":"X"},null,"","","","","","","","","","","","","","","","","","","","","","","","","","","","","","","","","","","","","","","","","","","","","","","","","","","","","","","","","","","","","","","","","","","","","",""]
["01: Niños",72,0,0,null,{"$f":"IF('S400'!G106<>\"\",'S400'!G106,\"X\")","v":"X"},null,"","","","","","","","","","","","","","","","","","","","","","","","","","","","","","","","","","","","","","","","","","","","","","","","","","","","","","","","","","","","","","","","","","","","","",""]
["02: Adultos",73,0,0,null,{"$f":"IF('S400'!G107<>\"\",'S400'!G107,\"X\")","v":"X"},null,"","","","","","","","","","","","","","","","","","","","","","","","","","","","","","","","","","","","","","","","","","","","","","","","","","","","","","","","","","","","","","","","","","","","","",""]
[null,74,0,0,null,{"$f":"IF('S400'!G108<>\"\",'S400'!G108,\"X\")","v":"X"},null,"","","","","","","","","","","","","","","","","","","","","","","","","","","","","","","","","","","","","","","","","","","","","","","","","","","","","","","","","","","","","","","","","","","","","",""]
[null,75,0,0,null,{"$f":"IF('S400'!G109<>\"\",'S400'!G109,\"X\")","v":"X"},null,"","","","","","","","","","","","","","","","","","","","","","","","","","","","","","","","","","","","","","","","","","","","","","","","","","","","","","","","","","","","","","","","","","","","","",""]
[null,76,0,0,null,{"$f":"IF('S400'!G110<>\"\",'S400'!G110,\"X\")","v":"X"},null,"","","","","","","","","","","","","","","","","","","","","","","","","","","","","","","","","","","","","","","","","","","","","","","","","","","","","","","","","","","","","","","","","","","","","",""]
[null,77,0,0,null,{"$f":"IF('S400'!G111<>\"\",'S400'!G111,\"X\")","v":"X"},null,"","","","","","","","","","","","","","","","","","","","","","","","","","","","","","","","","","","","","","","","","","","","","","","","","","","","","","","","","","","","","","","","","","","","","",""]
[null,78,0,0,null,{"$f":"IF('S400'!G112<>\"\",'S400'!G112,\"X\")","v":"X"},null,"","","","","","","","","","","","","","","","","","","","","","","","","","","","","","","","","","","","","","","","","","","","","","","","","","","","","","","","","","","","","","","","","","","","","",""]
[null,79,0,0,null,{"$f":"IF('S400'!G113<>\"\",'S400'!G113,\"X\")","v":"X"},null,"","","","","","","","","","","","","","","","","","","","","","","","","","","","","","","","","","","","","","","","","","","","","","","","","","","","","","","","","","","","","","","","","","","","","",""]
[null,80,0,0,null,{"$f":"IF('S400'!G114<>\"\",'S400'!G114,\"X\")","v":"X"},null,"","","","","","","","","","","","","","","","","","","","","","","","","","","","","","","","","","","","","","","","","","","","","","","","","","","","","","","","","","","","","","","","","","","","","",""]
[null,null,null,null,null,{"$f":"IF('S400'!G115<>\"\",'S400'!G115,\"X\")","v":"X"},null,null,"","","","","","","","","","","","","","","","","","","","","","","","","","","","","","","","","","","","","","","","","","","","","","","","","","","","","","","","","","","","","","","","","","","","",""]
[null,null,null,null,null,{"$f":"IF('S400'!G116<>\"\",'S400'!G116,\"X\")","v":"X"}]
[null,null,null,null,null,null,null,null,"---","---","---","---","---","---","---","---","---","---","---","---","---","---","---","---","---","---","---","---","---","---","---","---","---","---","---","---","---","---","---","---","---","---","---","---","---","---","---","---","---","---","---","---","---","---","---","---","---","---","---","---","---","---","---","---","---","---","---","---","---","---","---","---","---","---","---","---","---"]

{"sheet":"S800","index":11,"n_rows":63,"n_cols":21,"rows_kept":63,"cut":false,"hidden":false,"merged":[[6,1,6,16],[13,13,13,16],[31,4,31,12],[12,5,13,6],[13,3,14,3],[13,4,14,4],[13,17,13,20],[12,7,13,8],[13,9,13,12],[55,13,55,17],[55,3,56,3],[55,4,56,4],[55,5,55,6],[55,7,55,8],[55,9,55,12],[54,4,54,17],[32,3,33,3],[32,4,33,4],[32,5,32,6],[32,7,32,8],[32,9,32,12]]}
[]
[null,null,null,"CENSO EDUCATIVO 2024"]
[null,null,null,"LOCAL EDUCATIVO"]
[]
[]
[]
[null,"800. ESTADO DE LOS RECURSOS TECNOLÓGICOS Y EQUIPAMIENTO EN EL LOCAL EDUCATIVO [Para la gestión Pública y Privada]"]
[]
[]
[null,"801. RECURSOS TECNOLÓGICOS:",null,null,null,null,null,"CUENTA CON AL MENOS UN RECURSO TECNOLÓGICO DE LA SIGUIENTE LISTA :",null,null,"SI",null,null,"","NO"]
[]
[null,null,"(1)","(2)","(3) Cantidad de Recursos Tecnológicos Operativos"]
[null,null,null,null,null,"(2)\nSegún estado de conservación",null,"(3)\nSegún su antigüedad en el Local Educativo",null,"(4) Según el ambiente al que fue asignado"]
[null,"NRO",null,"Cantidad total\n\n(OPERATIVOS\n+ INOPERATIVOS)","(1)\n\nTotal\n\nOPERATIVOS",null,null,null,null,"(1)\nCONECTADOS POR CABLE",null,null,null,"(2)\nCONECTADOS POR WIFI",null,null,null,"(3)\nNO CONECTADOS"]
[null,{"$f":"SUM(D16:E27)","v":0},"Recurso tecnológico",null,null,"(1)\nEn buen estado","(2)\nNecesitan reparación","(1)\nMenos de 5 años (a partir de 2020)","(2)\nMás de 5 años (antes de 2020)","(1)\nAula de Clase","(2)\nAula de innovación pedagógica","(3)\nLaboratorio y/o talleres","(4)\nOtros ambientes complemen- tarios","(1)\nAula de Clase","(2)\nAula de innovación pedagógica","(3)\nLaboratorio y/o talleres","(4)\nOtros ambientes complemen-tarios","(1)\nAula de Clase","(2)\nAula de innovación pedagógica","(3)\nLaboratorio y/o talleres","(4)\nOtros ambientes complemen- tarios"]
[null,1,"PC de escritorio"]
[null,2,"Laptop convencional"]
[null,3,"Laptop XO"]
[null,4,"Servidor"]
[null,5,"Microservidor o Habilitador"]
[null,6,"Tablet - Aprendo en casa"]
[null,7,"Tablet - PRONATEL"]
[null,8,"Tablet - Otros"]
[null,9,"Proyector multimedia"]
[null,10,"Pizarra interactiva"]
[null,11,"Consola de audio para laboratorio de idiomas"]
[null,12,"Auriculares con audífonos y micrófono"]
[]
[]
[null,"802. EQUIPAMIENTO",null,null,null,null,null,"CUENTA CON AL MENOS UN DISPOSITIVO DE LA SIGUIENTE LISTA :",null,null,"SI","","NO"]
[]
[null,null,"(1)","(2)","(3)\nCantidad de equipos Operativos"]
[null,"NRO","Otros dispositivos","Cantidad total\n\n(OPERATIVOS\n+ \nINOPERA-\nTIVOS)","(1)\n\nTotal\n\nOPERA-\nTIVOS","(2) Según estado de conservación",null,"(3)\nSegún su antigüedad en el LE.",null,"(4)\nSegún el ambiente al que fue asignado"]
[null,{"$f":"SUM(D35:E50)","v":0},null,null,null,"(1)\nEn buen estado","(2)\nNecesitan reparación","(1)\nMenos de 5 años (a partir de2020)","(2)\nMás de 5 años (antes de 2020)","(1)\nAula de Clase","(2)\nAula de innovación pedagógica","(3)\nLaboratorio y/o talleres","(4)\nOtros ambientes complemen- tarios"]
[null,1,"TV"]
[null,2,"DVD / BLURAY"]
[null,3,"Radio, minicomponente"]
[null,4,"Equipo de sonido (Consolas separadas)"]
[null,5,"Parlante portátil"]
[null,6,"Parlante pasivo (Necesita amplificador para fun ...)"]
[null,7,"Sólo fotocopiadora"]
[null,8,"Sólo escáner"]
[null,9,"Sólo impresora"]
[null,10,"Multifuncional (Fotocopia, escanea e imprime)"]
[null,11,"Pantalla de proyección ECRAN"]
[null,12,"Kits de robótica educativa"]
[null,13,"Equipos de Talleres Ligeros"]
[null,14,"Equipos de Talleres Pesados"]
[null,15,"Equipos de aire acondicionado y/o climatización"]
[null,16,"Extractores de aire"]
[]
[]
[null,"803. EQUIPOS DE INTERCONEXIÓN Y PROTECCIÓN DE ENERGÍA",null,null,"CUENTA CON AL MENOS UN EQUIPO DE LA SIGUIENTE LISTA :",null,null,null,null,"","SI",null,null,null,"NO"]
[]
[null,null,"(1)","(2)","(3)\nCantidad de equipos Operativos"]
[null,"NRO",null,"Cantidad total\n\n(OPERATIVOS\n+ INOPERATIVOS)","(1)\n\nTotal\n\nOPERATIVOS","(2) Según estado de conservación",null,"(3)\nSegún su antigüedad en el LE.",null,"(4)\nSegún el ambiente al que fue asignado",null,null,null,"(5)\nCantidad de equipos según número de puertos"]
[null,{"$f":"SUM(D58:D63)","v":0},"Equipos de interconexión y protección",null,null,"(1)\nEn buen estado","(2)\nNecesitan reparación","(1)\nMenos de 5 años (a partir de2020)","(2)\nMás de 5 años (antes de 2020)","(1)\nAula de Clase","(2)\nAula de innovación pedagógica","(3)\nLaboratorio y/o talleres","(4)\nOtros ambientes complemen- tarios","(1)\nDe\n1 a 4\npuertos","(2)\nDe 5 a 8\npuertos","(3)\nDe 12 o 16\npuertos","(4)\nDe 24\npuertos","(5)\nDe 48\npuertos"]
[null,1,"Switch para red"]
[null,2,"Modem"]
[null,3,"Router"]
[null,4,"Access Point"]
[null,5,"UPS"]
[null,6,"Estabilizadores"]

{"sheet":"S900","index":12,"n_rows":178,"n_cols":29,"rows_kept":178,"cut":false,"hidden":false,"merged":[[120,3,120,18],[6,2,6,19],[1,5,1,17],[2,5,2,17],[113,6,113,8],[12,7,12,10],[10,3,13,5],[10,6,13,6],[12,11,12,14],[11,11,11,14],[10,7,10,14],[11,7,11,10],[10,17,13,19],[125,14,125,18],[127,14,127,18],[129,14,129,18],[131,14,131,18],[129,5,129,7],[125,5,125,7],[127,5,127,7],[10,20,13,20],[10,21,10,28],[11,21,11,24],[11,25,11,28],[12,21,12,24],[12,25,12,28]]}
[]
[null,null,null,null,null,"CENSO EDUCATIVO 2024"]
[null,null,null,null,null,"LOCAL EDUCATIVO"]
[]
[]
[]
[null,null,"900. INFORMACIÓN ESPECÍFICA POR ESPACIO EDUCATIVO Y/O ADMINISTRATIVO [Sólo para la Gestión Privada]"]
[]
[null,null,null,"901. RESPECTO A LOS ESPACIOS EDUCATIVOS Y/O ADMINISTRATIVOS, INDIQUE:"]
[]
[null,null,null,"TIPO DE ESPACIOS EDUCATIVOS Y\nADMINISTRATIVOS",null,null,"El local educativo cuenta con:\n\nSI - NO","CANTIDAD DE ESPACIOS",null,null,null,null,null,null,null,null,null,"TIPO DE ESPACIOS EDUCATIVOS Y\nADMINISTRATIVOS",null,null,"El local educativo cuenta con:\n\nSI - NO","CANTIDAD DE ESPACIOS"]
[null,null,null,null,null,null,null,"EN USO",null,null,null,"SIN USO",null,null,null,null,null,null,null,null,null,"EN USO",null,null,null,"SIN USO"]
["GESTION",null,null,null,null,null,null,"Estado de conservación",null,null,null,"Estado de conservación",null,null,null,null,null,null,null,null,null,"Estado de conservación",null,null,null,"Estado de conservación"]
[{"$f":"IF('S100'!B112=3,\"X\",\"\")","v":""},null,null,null,null,null,null,"TOTAL","Buen estado","Regular estado","Mal estado","TOTAL","Buen estado","Regular estado","Mal estado",null,null,null,null,null,null,"TOTAL","Buen estado","Regular estado","Mal estado","TOTAL","Buen estado","Regular estado","Mal estado"]
[null,null,null,"TIPO A Y D: AULAS Y SALAS",null,null,null,null,null,null,null,null,null,null,null,null,null,"BIENESTAR"]
[{"$f":"SUM(A17+A18)","v":0},null,"000","AULA DE CLASE",null,null,null,{"$f":"SUM(I16:K16)","v":0},null,null,null,{"$f":"SUM(M16:O16)","v":0},null,null,null,null,"068","QUIOSCO",null,null,null,{"$f":"SUM(W16:Y16)","v":0},null,null,null,{"$f":"SUM(AA16:AC16)","v":0}]
[{"$f":"COUNTIF($G$16:$G$93,\"SI\")+COUNTIF($U$16:$U$93,\"SI\")","v":0},null,"001","SALA O AULA DE PSICOMOTRICIDAD (INICIAL O CEBE O ISP/ESP",null,null,null,{"$f":"SUM(I17:K17)","v":0},null,null,null,{"$f":"SUM(M17:O17)","v":0},null,null,null,null,"069","CAFETERÍA",null,null,null,{"$f":"SUM(W17:Y17)","v":0},null,null,null,0]
[{"$f":"COUNTIF($G$16:$G$93,\"NO\")+COUNTIF($U$16:$U$93,\"NO\")","v":0},null,"002","AULA VIVENCIAL (CEBE)",null,null,null,{"$f":"SUM(I18:K18)","v":0},null,null,null,{"$f":"SUM(M18:O18)","v":0},null,null,null,null,"070","COMEDOR",null,null,null,{"$f":"SUM(W18:Y18)","v":0},null,null,null,0]
[null,null,"003","SALA EDUCATIVA (PRITE",null,null,null,0,null,null,null,0,null,null,null,null,"071","COCINA",null,null,null,0,null,null,null,0]
[null,null,"004","SALA DE USOS MÚLTIPLES (SUM)",null,null,null,0,null,null,null,0,null,null,null,null,"072","TÓPICO",null,null,null,0,null,null,null,0]
[null,null,"005","AUDITORIO",null,null,null,0,null,null,null,0,null,null,null,null,"073","LACTARIO (PRITE O ED. SUPERIOR O ETP)",null,null,null,0,null,null,null,0]
[null,null,"006","SALA DE DANZA (PRIMARIA Y SECUNDARIA)",null,null,null,0,null,null,null,0,null,null,null,null,"074","ESPACIO TEMPORAL PARA DOCENTE (INICIAL, PRIMARIA O SEC...)",null,null,null,0,null,null,null,0]
[null,null,"007","SALA DE MÚSICA (PRIMARIA Y SECUNDARIA O ESFA)",null,null,null,0,null,null,null,0,null,null,null,null,"075","RESIDENCIA ESTUDIANTIL (SECUNDARIA)",null,null,null,0,null,null,null,0]
[null,null,"008","SALA DE DANZAS FOLCLÓRICAS (ESFA)",null,null,null,0,null,null,null,0,null,null,null,null,"076","ESPACIO TEMPORAL PARA ACOMPAÑAMIENTO EN RESIDENCIA EST.",null,null,null,0,null,null,null,0]
[null,null,"009","SALA DE BALLET (ESFA)",null,null,null,0,null,null,null,0,null,null,null,null,"077","MÓDULO DE ACOMPAÑAMIENTO Y CONSEJERÍA (SECUNDARIA RE.)",null,null,null,0,null,null,null,0]
[null,null,"010","OTRO ESPACIO DE TIPO (A) O (D) O SIMILARES CARACTERÍSTICAS",null,null,null,0,null,null,null,0,null,null,null,null,"078","COORDINACIÓN DE TUTORÍA (JEC)",null,null,null,0,null,null,null,0]
[null,null,null,"TIPO B: AIP Y BIBLIOTECA",null,null,null,null,null,null,null,null,null,null,null,null,"079","SALA EQUIPO SAANEE (CEBE)",null,null,null,0,null,null,null,0]
[null,null,"011","BIBLIOTECA TIPO I – 75 M2 O MENOS (PRIMARIA Y SECUNDARIA)",null,null,null,0,null,null,null,0,null,null,null,null,"080","SALA PSICOPEDAGÓGICA (CEBE O ED. SUPERIOR)",null,null,null,0,null,null,null,0]
[null,null,"012","BIBLIOTECA TIPO II – 90 M2 (PRIMARIA Y SECUNDARIA)",null,null,null,0,null,null,null,0,null,null,null,null,"081","OFICINA APAFA (CEBE)",null,null,null,0,null,null,null,0]
[null,null,"013","BIBLIOTECA TIPO III – 120 M2 O MÁS (PRIMARIA Y SECUNDARIA)",null,null,null,0,null,null,null,0,null,null,null,null,"082","UNIDAD DE BIENESTAR Y EMPLEABILIDAD. (ED.SUPERIOR O ETP)",null,null,null,0,null,null,null,0]
[null,null,"014","BIBLIOTECA DE EDUCACIÓN SUPERIOR O TÉCNICO PRODUCTIVA",null,null,null,0,null,null,null,0,null,null,null,null,"083","CAPILLA, TEMPLO O SIMILAR. (ED.SUPERIOR O ETP)",null,null,null,0,null,null,null,0]
[null,null,"015","AULA DE INNOVACIÓN PEDAGÓGICA (PRIMARIA Y SECUNDARIA",null,null,null,0,null,null,null,0,null,null,null,null,"084","OTRO ESPACIO PARA BIENESTAR",null,null,null,0,null,null,null,0]
[null,null,"016","AULA DE IDIOMAS (ED.SUPERIOR O ETP)",null,null,null,0,null,null,null,0,null,null,null,null,null,"SERVICIOS GENERALES"]
[null,null,"017","CENTRO DE CÓMPUTO (ED.SUPERIOR O ETP)",null,null,null,0,null,null,null,0,null,null,null,null,"085","ALMACÉN GENERAL",null,null,null,0,null,null,null,{"$f":"SUM(AA34:AC34)","v":0}]
[null,null,"018","CENTRO DE RECURSOS (ED.SUPERIOR O ETP)",null,null,null,0,null,null,null,0,null,null,null,null,"086","DEPÓSITO GENERAL (ED.BÁSICA)",null,null,null,0,null,null,null,0]
[null,null,"019","OTRO ESPACIO DE TIPO (B) O SIMILARES CARACTERÍSTICAS",null,null,null,0,null,null,null,0,null,null,null,null,"087","VIGILANCIA O CASETA DE CONTROL",null,null,null,0,null,null,null,0]
[null,null,null,"TIPO C: LABORATORIOS Y TALLERES DE EDUCACIÓN ",null,null,null,null,null,null,null,null,null,null,null,null,"088","CUARTO DE MÁQUINAS Y CISTERNAS",null,null,null,0,null,null,null,0]
[null,null,"020","LABORATORIO DE CIENCIA Y TECNOLOGÍA (SECUNDARIA )",null,null,null,0,null,null,null,0,null,null,null,null,"089","AMBIENTE PARA ALMACENAMIENTO DE RESIDUOS SÓLIDOS",null,null,null,0,null,null,null,0]
[null,null,"021","TALLER CREATIVO (PRIMARIA)",null,null,null,0,null,null,null,0,null,null,null,null,"090","CUARTO DE LIMPIEZA",null,null,null,0,null,null,null,0]
[null,null,"022","TALLER DE ARTES ESCÉNICAS (CEBE)",null,null,null,0,null,null,null,0,null,null,null,null,"091","CUARTO ELÉCTRICO",null,null,null,0,null,null,null,0]
[null,null,"023","TALLER DE ARTE O CERÁMICA (SECUNDARIA O CEBE)",null,null,null,0,null,null,null,0,null,null,null,null,"092","GUARDIANÍA (ED.BÁSICA)",null,null,null,0,null,null,null,0]
[null,null,"024","TALLER DE EDUCACIÓN PARA EL TRABAJO",null,null,null,0,null,null,null,0,null,null,null,null,"093","MAESTRANZA",null,null,null,0,null,null,null,0]
[null,null,"025","TALLER DE EDUCACIÓN PARA EL TRABAJO CON ESPECIALIDAD",null,null,null,0,null,null,null,0,null,null,null,null,"094","MÓDULO DE CONECTIVIDAD (ESPACIO PARA SERVIDOR Y SWITCH)",null,null,null,0,null,null,null,0]
[null,null,"026","TALLER DE REPOSTERÍA Y COCINA (CEBE)",null,null,null,0,null,null,null,0,null,null,null,null,"095","DEPÓSITO DE IMPLEMENTOS DEPORTIVOS",null,null,null,0,null,null,null,0]
[null,null,"027","OTRO ESPACIO DE TIPO (C) O SIMILARES CARACTERÍSTICAS PARA …",null,null,null,0,null,null,null,0,null,null,null,null,"096","DEPÓSITO DE HERRAMIENTAS Y MATERIALES (TIPO G)",null,null,null,0,null,null,null,0]
[null,null,null,"TIPO C: LABORATORIOS Y TALLERES DE EDUCACIÓN SUPERIOR Y TÉCNICO PRODUCTIVA",null,null,null,null,null,null,null,null,null,null,null,null,"097","DEPÓSITO DE PRODUCTOS (TIPO G)",null,null,null,0,null,null,null,0]
[null,null,"028","LABORATORIO DE IDIOMAS",null,null,null,0,null,null,null,0,null,null,null,null,"098","OTRO ESPACIO DE SERVICIOS GENERALES",null,null,null,0,null,null,null,0]
[null,null,"029","LABORATORIO DE CIENCIAS",null,null,null,0,null,null,null,0,null,null,null,null,null,"SERVICIOS GENERALES"]
[null,null,"030","LABORATORIO MULTIFUNCIONAL , BIOQUÍMICA , MICROBIOLOGÍA",null,null,null,0,null,null,null,0,null,null,null,null,"099","DIRECCIÓN / DIRECCIÓN GENERAL",null,null,null,0,null,null,null,{"$f":"SUM(AA49:AC49)","v":0}]
[null,null,"031","LABORATORIO DE FARMACIA",null,null,null,0,null,null,null,0,null,null,null,null,"100","SUBDIRECCIÓN (ED.BÁSICA, ED. SUPERIOR O ETP)",null,null,null,0,null,null,null,0]
[null,null,"032","LABORATORIO DE SUELOS",null,null,null,0,null,null,null,0,null,null,null,null,"101","ADMINISTRACIÓN /ÁREA ADMINISTRATIVA",null,null,null,0,null,null,null,0]
[null,null,"033","LABORATORIO DE CONTROL DE CALIDAD",null,null,null,0,null,null,null,0,null,null,null,null,"102","OFICINA DE COORDINACIÓN PEDAGÓGICA (ED.BÁSICA)",null,null,null,0,null,null,null,0]
[null,null,"034","OTROS TIPOS DE LABORATORIOS PARA ED.SUPERIOR O ETP",null,null,null,0,null,null,null,0,null,null,null,null,"103","ÁREA DE ESPERA Y/O SECRETARIA",null,null,null,0,null,null,null,0]
[null,null,"035","TALLER DE EDUCACIÓN PARA EL TRABAJO (EPT)",null,null,null,0,null,null,null,0,null,null,null,null,"104","ARCHIVO, ECONOMATO Y/O DEPÓSITO DOCUMENTAL",null,null,null,0,null,null,null,0]
[null,null,"036","TALLER DE INFORMÁTICA",null,null,null,0,null,null,null,0,null,null,null,null,"105","SALA DE DOCENTES / SALA PARA EL PERSONAL DOCENTE",null,null,null,0,null,null,null,0]
[null,null,"037","TALLER DE CORTE, PEINADO, LACEADO Y TINTADO DE CABELLO",null,null,null,0,null,null,null,0,null,null,null,null,"106","SALA DE REUNIONES",null,null,null,0,null,null,null,0]
[null,null,"038","TALLER DE PODOESTÉTICA",null,null,null,0,null,null,null,0,null,null,null,null,"107","SALA DE PROFESIONALES (CEBE)",null,null,null,0,null,null,null,0]
[null,null,"039","TALLER DE LOCUCIÓN RADIAL",null,null,null,0,null,null,null,0,null,null,null,null,"108","UNIDAD ACADÉMICA (ED.SUPERIOR O ETP)",null,null,null,0,null,null,null,0]
[null,null,"040","TALLER DE RECEPCIÓN HOTELERA",null,null,null,0,null,null,null,0,null,null,null,null,"109","COORDINACIÓN DE PROGRAMAS DE ESTUDIOS (ED.SUPERIOR O ETP)",null,null,null,0,null,null,null,0]
[null,null,"041","TALLER DE HOTELERÍA",null,null,null,0,null,null,null,0,null,null,null,null,"110","UNIDAD DE INVESTIGACIÓN (ED.SUPERIOR O ETP)",null,null,null,0,null,null,null,0]
[null,null,"042","TALLER DE NEUMÁTICA E HIDRÁULICA",null,null,null,0,null,null,null,0,null,null,null,null,"111","UNIDAD DE FORMACIÓN CONTINUA (ED.SUPERIOR O ETP)",null,null,null,0,null,null,null,0]
[null,null,"043","TALLER DE CIRCUITOS ELÉCTRICOS Y/O ELECTRÓNICOS",null,null,null,0,null,null,null,0,null,null,null,null,"112","ÁREA DE CALIDAD (ED.SUPERIOR O ETP)",null,null,null,0,null,null,null,0]
[null,null,"044","TALLER DE COCINA",null,null,null,0,null,null,null,0,null,null,null,null,"113","SECRETARÍA ACADÉMICA (ED.SUPERIOR O ETP)",null,null,null,0,null,null,null,0]
[null,null,"045","TALLER DE REPOSTERÍA",null,null,null,0,null,null,null,0,null,null,null,null,"114","OTRO ESPACIO DE GESTIÓN ADMINISTRATIVA Y PEDAGÓGICA",null,null,null,0,null,null,null,0]
[null,null,"046","TALLER DE BAR Y COCTELERÍA",null,null,null,0,null,null,null,0,null,null,null,null,null,"TIPO E: ESPACIOS DEPORTIVOS (ABIERTOS)"]
[null,null,"047","TALLER DE HOSPITALIZACIÓN",null,null,null,0,null,null,null,0,null,null,null,null,"115","LOSA MULTIUSO TIPO I 15 x 28 (3 DEPORTES/NO PATIOS)",null,null,null,0,null,null,null,{"$f":"SUM(AA66:AC66)","v":0}]
[null,null,"048","TALLER DE TERAPIA (MOTRICIDAD, SENSORIAL, AUDIOVISUAL",null,null,null,0,null,null,null,0,null,null,null,null,"116","LOSA MULTIUSO TIPO II 20 x 40 (5 DEPORTES/NO PATIOS)",null,null,null,0,null,null,null,0]
[null,null,"049","TALLER DE DIBUJO TÉCNICO",null,null,null,0,null,null,null,0,null,null,null,null,"117","PISTA DE VELOCIDAD Y SALTOS (80 A 120 METROS LINEALES)",null,null,null,0,null,null,null,0]
[null,null,"050","TALLER DE CORTE, CONFECCIÓN Y PATRONAJE",null,null,null,0,null,null,null,0,null,null,null,null,"118","PISCINA SEMIOLÍMPICA SIN TECHAR (ED. BÁSICA)",null,null,null,0,null,null,null,0]
[null,null,"051","TALLER DE ESCULTURA",null,null,null,0,null,null,null,0,null,null,null,null,"119","PISCINA OLÍMPICA SIN TECHAR (ED. BÁSICA)",null,null,null,0,null,null,null,0]
[null,null,"052","TALLER PINTURA",null,null,null,0,null,null,null,0,null,null,null,null,"120","CAMPO DE FÚTBOL Y CAMPO ATLÉTICO (ED. BÁSICA)",null,null,null,0,null,null,null,0]
[null,null,"053","TALLER DE DIBUJO",null,null,null,0,null,null,null,0,null,null,null,null,"121","SOLO CAMPO DE FÚTBOL (ED. BÁSICA)",null,null,null,0,null,null,null,0]
[null,null,"054","TALLER DE MEDICIONES ELÉCTRICAS",null,null,null,0,null,null,null,0,null,null,null,null,"122","SOLO CAMPO ATLÉTICO (ED. BÁSICA)",null,null,null,0,null,null,null,0]
[null,null,"055","TALLER DE MOTORES DE VEHÍCULOS",null,null,null,0,null,null,null,0,null,null,null,null,"123","OTRO ESPACIO DEPORTIVO ABIERTO",null,null,null,0,null,null,null,0]
[null,null,"056","TALLER DE MECÁNICA DE BANCO, SOLDADURA Y RECTIFICACIONES",null,null,null,0,null,null,null,0,null,null,null,null,null,"TIPO F Y G: ESPACIOS EXTERIORES Y DE RELACIÓN CON LA NATURALEZA"]
[null,null,"057","TALLER DE TRANSMISIÓN DE VEHÍCULOS",null,null,null,0,null,null,null,0,null,null,null,null,"124","ÁREA DE INGRESO",null,null,null,0,null,null,null,{"$f":"SUM(AA76:AC76)","v":0}]
[null,null,"058","TALLER DE SOLDADURA",null,null,null,0,null,null,null,0,null,null,null,null,"125","PASADIZOS Y CIRCULACIONES",null,null,null,0,null,null,null,0]
[null,null,"059","TALLER DE INSTALACIONES ELÉCTRICAS",null,null,null,0,null,null,null,0,null,null,null,null,"126","PATIO",null,null,null,0,null,null,null,0]
[null,null,"060","TALLER DE INSTALACIONES SANITARIAS",null,null,null,0,null,null,null,0,null,null,null,null,"127","ÁREA DE RECREACIÓN (ED. BÁSICA)",null,null,null,0,null,null,null,0]
[null,null,"061","TALLER DE JOYERÍA",null,null,null,0,null,null,null,0,null,null,null,null,"128","ÁREAS VERDES Y JARDÍNES (ED. BÁSICA)",null,null,null,0,null,null,null,0]
[null,null,"062","OTROS TIPOS DE TALLERES PARA ED.SUPERIOR O ETP",null,null,null,0,null,null,null,0,null,null,null,null,"129","ESPACIO DE CULTIVO (EBR O ED. SUPERIOR O ETP)",null,null,null,0,null,null,null,0]
[null,null,null,"TIPO E: ESPACIOS DEPORTIVOS ",null,null,null,null,null,null,null,null,null,null,null,null,"130","ESPACIO DE CRIANZA DE ANIMALES (EBR O ED. SUPERIOR O ETP)",null,null,null,{"$f":"SUM(W82:Y82)","v":0},null,null,null,0]
[null,null,"063","GIMNASIO (ED.BÁSICA)",null,null,null,0,null,null,null,0,null,null,null,null,"131","TRIBUNA / GRADERÍA",null,null,null,{"$f":"SUM(W83:Y83)","v":0},null,null,null,0]
[null,null,"064","COLISEO POLIDEPORTIVO (ED.BÁSICA)",null,null,null,{"$f":"SUM(I84:K84)","v":0},null,null,null,{"$f":"SUM(M84:O84)","v":0},null,null,null,null,"132","OTRO ESPACIO EXTERIOR Y DE RELACIÓN",null,null,null,{"$f":"SUM(W84:Y84)","v":0},null,null,null,0]
[null,null,"065","PISCINA SEMIOLÍMPICA TECHADA (ED.BÁSICA)",null,null,null,{"$f":"SUM(I85:K85)","v":0},null,null,null,{"$f":"SUM(M85:O85)","v":0},null,null,null,null,null,"SERVICIOS HIGIÉNICOS"]
[null,null,"066","PISCINA OLÍMPICA TECHADA (ED.BÁSICA)",null,null,null,{"$f":"SUM(I86:K86)","v":0},null,null,null,{"$f":"SUM(M86:O86)","v":0},null,null,null,null,"133","SS.HH. PARA ESTUDIANTES",null,null,null,{"$f":"SUM(W86:Y86)","v":0},null,null,null,{"$f":"SUM(AA86:AC86)","v":0}]
[null,null,"067","OTRO ESPACIO DEPORTIVO CERRADO",null,null,null,{"$f":"SUM(I87:K87)","v":0},null,null,null,{"$f":"SUM(M87:O87)","v":0},null,null,null,null,"134","SS.HH. PARA DOCENTES",null,null,null,0,null,null,null,0]
[null,null,null,null,null,null,null,null,null,null,null,null,null,null,null,null,"135","SS.HH. PARA ESTUDIANTES Y DOCENTES",null,null,null,0,null,null,null,0]
[null,null,null,null,null,null,null,null,null,null,null,null,null,null,null,null,"136","SS.HH. PARA PERSONAL ADMINISTRATIVO",null,null,null,0,null,null,null,0]
[null,null,null,null,null,null,null,null,null,null,null,null,null,null,null,null,"137","SS.HH. PARA ADULTOS",null,null,null,0,null,null,null,0]
[null,null,null,null,null,null,null,null,null,null,null,null,null,null,null,null,"138","SS.HH. PARA PERSONAL DE SERVICIO",null,null,null,0,null,null,null,0]
[null,null,null,null,null,null,null,null,null,null,null,null,null,null,null,null,"139","VESTIDORES PARA ESTUDIANTES",null,null,null,0,null,null,null,0]
[null,null,null,null,null,null,null,null,null,null,null,null,null,null,null,null,"140","VESTIDORES PARA PERSONAL DE SERVICIO",null,null,null,0,null,null,null,{"$f":"SUM(AA93:AC93)","v":0}]
[]
[null,null,{"$f":"SUM(H54,H43,H42)+SUM(L42,L43,L54)","v":0},"SI REPORTÓ CONTAR CON AL MENOS UN ESPACIO DE TALLER PARA EDUCACIÓN PARA EL TRABAJO (EPT), ATIENDA LAS SIGUIENTES PREGUNTAS: [SÓLO PARA LA GESTIÓN PRIVADA]"]
[null,null,null,"902. ¿LOS TALLERES PARA EL ÁREA DE EDUCACIÓN PARA EL TRABAJO CUENTAN",null,null,null,null,null,null,null,"903. EL EQUIPAMIENTO DE LOS TALLERES PARA EL ÁREA DE EDUCACIÓN PARA"]
[null,null,null," CON EL EQUIPAMIENTO BÁSICO PARA EL DESARROLLO DE LA ESPECIALIDAD",null,null,null,null,null,null,null," EL TRABAJO, ¿SE ENCUENTRAN OPERATIVOS Y EN FUNCIONAMIENTO?"]
[null,null,null," QUE OFERTA?"]
[null,null,null,null,null,"Sí",null,null,null,null,null,null,null,null,null,null,null,"Sí"]
[]
[null,null,null,null,null,"No","Pase a la pregunta 904.",null,null,null,null,null,null,null,null,null,null,"No"]
[]
[null,null,{"$f":"SUM(H83:H87)+SUM(V66:V74)+SUM(L83:L87)+SUM(Z66:Z74)","v":0},"SI REPORTÓ CONTAR CON AL MENOS UN ESPACIO DEPORTIVO YA SEA CERRADO O ABIERTO, ATIENDA LAS SIGUIENTES PREGUNTAS: [SÓLO PARA LA GESTIÓN PRIVADA]"]
[null,null,null,"904. ALGUNO DE LOS ESPACIOS DEPORTIVOS (YA SEAN CERRADOS O ABIERTOS),",null,null,null,null,null,null,null,"906. AL MENOS UNO DE LOS ESPACIOS DEPORTIVOS (YA SEAN CERRADOS ABIERTOS)"]
[null,null,null,"¿SE ENCUENTRAN EN CONCESIÓN?",null,null,null,null,null,null,null,"¿CUENTA CON EL SIGUIENTE EQUIPAMIENTO DEPORTIVO?"]
[null,null,null,null,null,null,null,null,null,null,null,"Marque con una “X” una ó más alternativa"]
[null,null,null,null,null,"Sí"]
[]
[null,null,null,null,null,"No",null,null,null,null,null,null,null,null,null,null,null,"1. Arcos - Fútbol"]
[null,null,null,null,null,null,null,null,null,null,null,null,null,null,null,null,null,"2. Arcos con mallas - Fútbol"]
[null,null,null,"905. ALGUNO DE LOS ESPACIOS DEPORTIVOS (YA SEAN CERRADOS O ABIERTOS),",null,null,null,null,null,null,null,null,null,null,null,null,null,"3. Tableros con aros - Baloncesto"]
[null,null,null,"¿SE ENCUENTRA OCUPADO POR ALGUNA INFRAESTRUCTURA PORTÁTIL, U OTRO?",null,null,null,null,null,null,null,null,null,null,null,null,null,"4. Aro y malla - Baloncesto"]
[null,null,null,null,null,null,null,null,null,null,null,null,null,null,null,null,null,"5. Parantes - Vóley"]
[null,null,null,null,null,"Sí               Especifique :",null,null,null,null,null,null,null,null,null,null,null,"6. Net - Vóley"]
[null,null,null,null,null,null,null,null,null,null,null,null,null,null,null,null,null,"7. Ninguno de los anteriores"]
[null,null,null,null,null,"No"]
[]
[]
[null,null,null,"ANOTACIONES COMPLEMENTARIAS QUE CONSIDERE IMPORTANTE AGREGAR"]
[]
[null,null,null,null,null,null,null,null,null,null,null,null,null,null,null,null,null,null,null,{"$f":"LEN(TRIM(D121))","v":0}]
[]
[]
[null,null,null,"PERSONAL RESPONSABLE DEL LLENADO DE LA FICHA"]
[]
[null,null,null,"Nombres:",null,null,null,null,null,null,"Apellidos:"]
[]
[null,null,null,"Profesión:",null,null,null,null,null,null,"N° de colegiatura:"]
[]
[null,null,null,"Correo electrónico:",null,null,null,null,null,null,"Cargo:"]
[]
[null,null,null,null,null,null,null,null,null,null,"Teléfono celular:"]
[]
[null,null,null,null,null,"Declaro haber revisado con detenimiento el instructivo brindado por la DIGEIE y la Unidad de Estadística"]
[]
[]
[]
[]
["ESPECIALISTA"]
["DIRECTOR(A)"]
["SUB DIRECTOR(A)"]
["DOCENTE"]
["COORDINADOR(A)"]
["ASESOR"]
["ADMINISTRATIVO"]
["ASISTENTE"]
["AUXILIAR"]
["SECRETARIA(O)"]
["ESTADÍSTICO"]
["ESPECIALISTA"]
["BIBLIOTECARIO"]
["CARE"]
["COMANDANTE PNP"]
["CONTADOR"]
["DAIP"]
["DIGITADOR(A)"]
["GERENTE"]
["JEFE ACADÉMICO"]
["JEFE ADMINISTRATIVO"]
["JEFE DE AREA"]
["JEFE DE LABORATORIO"]
["JEFE DE PERSONAL"]
["JEFE DE SEDE"]
["JEFE UNIDAD"]
["OFICINISTA"]
["OPERADOR DE SISTEMAS"]
["PERSONAL DE SERVICIO"]
["PROGRAMADOR"]
["PROMOTOR(A)"]
["PSICOLOGO"]
["REGISTRADOR(A)"]
["REPRESENTANTE LEGAL"]
["SOPORTE TECNOLOGICO"]
["TÉCNICO ADMINISTRATIVO"]
["TESORERO(A)"]
["TRABAJADOR SOCIAL"]
["TUTOR"]
["OTROS"]

{"sheet":"Enviar","index":13,"n_rows":10,"n_cols":4,"rows_kept":10,"cut":false,"hidden":false,"merged":[[1,2,1,3],[2,2,2,3]]}
[]
[null,null,"CENSO EDUCATIVO 2024"]
[null,null,"LOCAL EDUCATIVO"]
[]
[]
[null,null,"Paso 1:","Realice el ENVÍO con su clave EOL."]
[]
[null,null,"Paso 2:","Una vez realizado el ENVÍO,  Revise su constancia de envio."]
[]
[null,null,"  ADVERTENCIA","ASEGÚRESE DE REGISTRAR TODA LA INFORMACIÓN DEL NIVEL INFORMANTE"]

{"sheet":"Ubigeo_UGEL","index":14,"n_rows":1894,"n_cols":8,"rows_kept":1894,"cut":false,"hidden":false,"merged":[]}
[null,"CÓDIGOS DE UBICACIÓN GEOGRÁFICA",null,null,null,null,"CÓDIGOS DE DRE Y UGEL"]
[]
[null,"CÓDIGO","DEPARTAMENTO","PROVINCIA","DISTRITO",null,"CÓDIGO","DENOMINACIÓN DE DRE O UGEL"]
[null,"010101","AMAZONAS","CHACHAPOYAS","CHACHAPOYAS",null,"010000","DRE AMAZONAS"]
[null,"010102","AMAZONAS","CHACHAPOYAS","ASUNCION",null,"010001","UGEL Chachapoyas"]
[null,"010103","AMAZONAS","CHACHAPOYAS","BALSAS",null,"010002","UGEL Bagua"]
[null,"010104","AMAZONAS","CHACHAPOYAS","CHETO",null,"010003","UGEL Bongara"]
[null,"010105","AMAZONAS","CHACHAPOYAS","CHILIQUIN",null,"010004","UGEL Condorcanqui"]
[null,"010106","AMAZONAS","CHACHAPOYAS","CHUQUIBAMBA",null,"010005","UGEL Luya"]
[null,"010107","AMAZONAS","CHACHAPOYAS","GRANADA",null,"010006","UGEL Rodriguez de Mendoza"]
[null,"010108","AMAZONAS","CHACHAPOYAS","HUANCAS",null,"010007","UGEL Utcubamba"]
[null,"010109","AMAZONAS","CHACHAPOYAS","LA JALCA",null,"010009","UGEL IBIR-IMAZA"]
[null,"010110","AMAZONAS","CHACHAPOYAS","LEIMEBAMBA",null,"020000","DRE ANCASH"]
[null,"010111","AMAZONAS","CHACHAPOYAS","LEVANTO",null,"020001","UGEL Huaraz"]
[null,"010112","AMAZONAS","CHACHAPOYAS","MAGDALENA",null,"020002","UGEL Aija"]
[null,"010113","AMAZONAS","CHACHAPOYAS","MARISCAL CASTILLA",null,"020003","UGEL Antonio Raymondi"]
[null,"010114","AMAZONAS","CHACHAPOYAS","MOLINOPAMPA",null,"020004","UGEL Asuncion"]
[null,"010115","AMAZONAS","CHACHAPOYAS","MONTEVIDEO",null,"020005","UGEL Bolognesi"]
[null,"010116","AMAZONAS","CHACHAPOYAS","OLLEROS",null,"020006","UGEL Carhuaz"]
[null,"010117","AMAZONAS","CHACHAPOYAS","QUINJALCA",null,"020007","UGEL Carlos Fermin Fitzcarrald"]
[null,"010118","AMAZONAS","CHACHAPOYAS","SAN FRANCISCO DE DAGUAS",null,"020008","UGEL Casma"]
[null,"010119","AMAZONAS","CHACHAPOYAS","SAN ISIDRO DE MAINO",null,"020009","UGEL Corongo"]
[null,"010120","AMAZONAS","CHACHAPOYAS","SOLOCO",null,"020010","UGEL Huari"]
[null,"010121","AMAZONAS","CHACHAPOYAS","SONCHE",null,"020011","UGEL Huarmey"]
[null,"010201","AMAZONAS","BAGUA","BAGUA",null,"020012","UGEL Huaylas"]
[null,"010202","AMAZONAS","BAGUA","ARAMANGO",null,"020013","UGEL Mariscal Luzuriaga"]
[null,"010203","AMAZONAS","BAGUA","COPALLIN",null,"020014","UGEL Ocros"]
[null,"010204","AMAZONAS","BAGUA","EL PARCO",null,"020015","UGEL Pallasca"]
[null,"010205","AMAZONAS","BAGUA","IMAZA",null,"020016","UGEL Pomabamba"]
[null,"010206","AMAZONAS","BAGUA","LA PECA",null,"020017","UGEL Recuay"]
[null,"010301","AMAZONAS","BONGARA","JUMBILLA",null,"020018","UGEL Santa"]
[null,"010302","AMAZONAS","BONGARA","CHISQUILLA",null,"020019","UGEL Sihuas"]
[null,"010303","AMAZONAS","BONGARA","CHURUJA",null,"020020","UGEL Yungay"]
[null,"010304","AMAZONAS","BONGARA","COROSHA",null,"030000","DRE APURIMAC"]
[null,"010305","AMAZONAS","BONGARA","CUISPES",null,"030001","UGEL Abancay"]
[null,"010306","AMAZONAS","BONGARA","FLORIDA",null,"030002","UGEL Andahuaylas"]
[null,"010307","AMAZONAS","BONGARA","JAZAN",null,"030003","UGEL Antabamba"]
[null,"010308","AMAZONAS","BONGARA","RECTA",null,"030004","UGEL Aymaraes"]
[null,"010309","AMAZONAS","BONGARA","SAN CARLOS",null,"030005","UGEL Cotabambas"]
[null,"010310","AMAZONAS","BONGARA","SHIPASBAMBA",null,"030006","UGEL Chincheros"]
[null,"010311","AMAZONAS","BONGARA","VALERA",null,"030007","UGEL Grau"]
[null,"010312","AMAZONAS","BONGARA","YAMBRASBAMBA",null,"030008","UGEL Huancarama"]
[null,"010401","AMAZONAS","CONDORCANQUI","NIEVA",null,"040000","GRE AREQUIPA"]
[null,"010402","AMAZONAS","CONDORCANQUI","EL CENEPA",null,"040001","UGEL Arequipa Norte"]
[null,"010403","AMAZONAS","CONDORCANQUI","RIO SANTIAGO",null,"040002","UGEL Arequipa Sur"]
[null,"010501","AMAZONAS","LUYA","LAMUD",null,"040003","UGEL Camana"]
[null,"010502","AMAZONAS","LUYA","CAMPORREDONDO",null,"040004","UGEL Caraveli"]
[null,"010503","AMAZONAS","LUYA","COCABAMBA",null,"040005","UGEL Castilla"]
[null,"010504","AMAZONAS","LUYA","COLCAMAR",null,"040006","UGEL Caylloma"]
[null,"010505","AMAZONAS","LUYA","CONILA",null,"040007","UGEL Condesuyos"]
[null,"010506","AMAZONAS","LUYA","INGUILPATA",null,"040008","UGEL Islay"]
[null,"010507","AMAZONAS","LUYA","LONGUITA",null,"040009","UGEL La Union"]
[null,"010508","AMAZONAS","LUYA","LONYA CHICO",null,"040010","UGEL La Joya"]
[null,"010509","AMAZONAS","LUYA","LUYA",null,"050000","DRE AYACUCHO"]
[null,"010510","AMAZONAS","LUYA","LUYA VIEJO",null,"050001","UGEL Huamanga"]
[null,"010511","AMAZONAS","LUYA","MARIA",null,"050002","UGEL Cangallo"]
[null,"010512","AMAZONAS","LUYA","OCALLI",null,"050003","UGEL Huancasancos"]
[null,"010513","AMAZONAS","LUYA","OCUMAL",null,"050004","UGEL Huanta"]
[null,"010514","AMAZONAS","LUYA","PISUQUIA",null,"050005","UGEL La Mar"]
[null,"010515","AMAZONAS","LUYA","PROVIDENCIA",null,"050006","UGEL Lucanas"]
[null,"010516","AMAZONAS","LUYA","SAN CRISTOBAL",null,"050007","UGEL Parinacochas"]
[null,"010517","AMAZONAS","LUYA","SAN FRANCISCO DEL YESO",null,"050008","UGEL Paucar del Sarasara"]
[null,"010518","AMAZONAS","LUYA","SAN JERONIMO",null,"050009","UGEL Sucre"]
[null,"010519","AMAZONAS","LUYA","SAN JUAN DE LOPECANCHA",null,"050010","UGEL Victor Fajardo"]
[null,"010520","AMAZONAS","LUYA","SANTA CATALINA",null,"050011","UGEL Vilcashuaman"]
[null,"010521","AMAZONAS","LUYA","SANTO TOMAS",null,"060000","DRE CAJAMARCA"]
[null,"010522","AMAZONAS","LUYA","TINGO",null,"060001","UGEL Cajamarca"]
[null,"010523","AMAZONAS","LUYA","TRITA",null,"060002","UGEL Cajabamba"]
[null,"010601","AMAZONAS","RODRIGUEZ DE MENDOZA","SAN NICOLAS",null,"060003","UGEL Celendin"]
[null,"010602","AMAZONAS","RODRIGUEZ DE MENDOZA","CHIRIMOTO",null,"060004","UGEL Chota"]
[null,"010603","AMAZONAS","RODRIGUEZ DE MENDOZA","COCHAMAL",null,"060005","UGEL Contumaza"]
[null,"010604","AMAZONAS","RODRIGUEZ DE MENDOZA","HUAMBO",null,"060006","UGEL Cutervo"]
[null,"010605","AMAZONAS","RODRIGUEZ DE MENDOZA","LIMABAMBA",null,"060007","UGEL Hualgayoc"]
[null,"010606","AMAZONAS","RODRIGUEZ DE MENDOZA","LONGAR",null,"060008","UGEL Jaen"]
[null,"010607","AMAZONAS","RODRIGUEZ DE MENDOZA","MARISCAL BENAVIDES",null,"060009","UGEL San Ignacio"]
[null,"010608","AMAZONAS","RODRIGUEZ DE MENDOZA","MILPUC",null,"060010","UGEL San Marcos"]
[null,"010609","AMAZONAS","RODRIGUEZ DE MENDOZA","OMIA",null,"060011","UGEL San Miguel"]
[null,"010610","AMAZONAS","RODRIGUEZ DE MENDOZA","SANTA ROSA",null,"060012","UGEL San Pablo"]
[null,"010611","AMAZONAS","RODRIGUEZ DE MENDOZA","TOTORA",null,"060013","UGEL Santa Cruz"]
[null,"010612","AMAZONAS","RODRIGUEZ DE MENDOZA","VISTA ALEGRE",null,"070101","DRE CALLAO"]
[null,"010701","AMAZONAS","UTCUBAMBA","BAGUA GRANDE",null,"070102","UGEL Ventanilla"]
[null,"010702","AMAZONAS","UTCUBAMBA","CAJARURO",null,"080000","DRE CUSCO"]
[null,"010703","AMAZONAS","UTCUBAMBA","CUMBA",null,"080001","UGEL Cusco"]
[null,"010704","AMAZONAS","UTCUBAMBA","EL MILAGRO",null,"080002","UGEL Acomayo"]
[null,"010705","AMAZONAS","UTCUBAMBA","JAMALCA",null,"080003","UGEL Anta"]
[null,"010706","AMAZONAS","UTCUBAMBA","LONYA GRANDE",null,"080004","UGEL Calca"]
[null,"010707","AMAZONAS","UTCUBAMBA","YAMON",null,"080005","UGEL Canas"]
[null,"020101","ANCASH","HUARAZ","HUARAZ",null,"080006","UGEL Canchis"]
[null,"020102","ANCASH","HUARAZ","COCHABAMBA",null,"080007","UGEL Chumbivilcas"]
[null,"020103","ANCASH","HUARAZ","COLCABAMBA",null,"080008","UGEL Espinar"]
[null,"020104","ANCASH","HUARAZ","HUANCHAY",null,"080009","UGEL La Convencion"]
[null,"020105","ANCASH","HUARAZ","INDEPENDENCIA",null,"080010","UGEL Paruro"]
[null,"020106","ANCASH","HUARAZ","JANGAS",null,"080011","UGEL Paucartambo"]
[null,"020107","ANCASH","HUARAZ","LA LIBERTAD",null,"080012","UGEL Quispicanchi"]
[null,"020108","ANCASH","HUARAZ","OLLEROS",null,"080013","UGEL Urubamba"]
[null,"020109","ANCASH","HUARAZ","PAMPAS GRANDE",null,"080014","UGEL Pichari-Kimbiri"]
[null,"020110","ANCASH","HUARAZ","PARIACOTO",null,"090000","DRE HUANCAVELICA"]
[null,"020111","ANCASH","HUARAZ","PIRA",null,"090001","UGEL Huancavelica"]
[null,"020112","ANCASH","HUARAZ","TARICA",null,"090002","UGEL Acobamba"]
[null,"020201","ANCASH","AIJA","AIJA",null,"090003","UGEL Angaraes"]
[null,"020202","ANCASH","AIJA","CORIS",null,"090004","UGEL Castrovirreyna"]
[null,"020203","ANCASH","AIJA","HUACLLAN",null,"090005","UGEL Churcampa"]
[null,"020204","ANCASH","AIJA","LA MERCED",null,"090006","UGEL Huaytara"]
[null,"020205","ANCASH","AIJA","SUCCHA",null,"090007","UGEL Tayacaja"]
[null,"020301","ANCASH","ANTONIO RAYMONDI","LLAMELLIN",null,"090009","UGEL Surcubamba"]
[null,"020302","ANCASH","ANTONIO RAYMONDI","ACZO",null,"100000","DRE HUANUCO"]
[null,"020303","ANCASH","ANTONIO RAYMONDI","CHACCHO",null,"100001","UGEL Huanuco"]
[null,"020304","ANCASH","ANTONIO RAYMONDI","CHINGAS",null,"100002","UGEL Ambo"]
[null,"020305","ANCASH","ANTONIO RAYMONDI","MIRGAS",null,"100003","UGEL Dos de Mayo"]
[null,"020306","ANCASH","ANTONIO RAYMONDI","SAN JUAN DE RONTOY",null,"100004","UGEL Lauricocha"]
[null,"020401","ANCASH","ASUNCION","CHACAS",null,"100005","UGEL Yarowilca"]
[null,"020402","ANCASH","ASUNCION","ACOCHACA",null,"100006","UGEL Huacaybamba"]
[null,"020501","ANCASH","BOLOGNESI","CHIQUIAN",null,"100007","UGEL Huamalies"]
[null,"020502","ANCASH","BOLOGNESI","ABELARDO PARDO LEZAMETA",null,"100008","UGEL Leoncio Prado"]
[null,"020503","ANCASH","BOLOGNESI","ANTONIO RAYMONDI",null,"100009","UGEL Marañon"]
[null,"020504","ANCASH","BOLOGNESI","AQUIA",null,"100010","UGEL Pachitea"]
[null,"020505","ANCASH","BOLOGNESI","CAJACAY",null,"100011","UGEL Puerto Inca"]
[null,"020506","ANCASH","BOLOGNESI","CANIS",null,"110000","DRE ICA"]
[null,"020507","ANCASH","BOLOGNESI","COLQUIOC",null,"110001","UGEL Ica"]
[null,"020508","ANCASH","BOLOGNESI","HUALLANCA",null,"110002","UGEL Chincha"]
[null,"020509","ANCASH","BOLOGNESI","HUASTA",null,"110003","UGEL Nasca"]
[null,"020510","ANCASH","BOLOGNESI","HUAYLLACAYAN",null,"110004","UGEL Palpa"]
[null,"020511","ANCASH","BOLOGNESI","LA PRIMAVERA",null,"110005","UGEL Pisco"]
[null,"020512","ANCASH","BOLOGNESI","MANGAS",null,"120000","DRE JUNIN"]
[null,"020513","ANCASH","BOLOGNESI","PACLLON",null,"120001","UGEL Huancayo"]
[null,"020514","ANCASH","BOLOGNESI","SAN MIGUEL DE CORPANQUI",null,"120002","UGEL Chupaca"]
[null,"020515","ANCASH","BOLOGNESI","TICLLOS",null,"120003","UGEL Concepcion"]
[null,"020601","ANCASH","CARHUAZ","CARHUAZ",null,"120004","UGEL Chanchamayo"]
[null,"020602","ANCASH","CARHUAZ","ACOPAMPA",null,"120005","UGEL Jauja"]
[null,"020603","ANCASH","CARHUAZ","AMASHCA",null,"120006","UGEL Junin"]
[null,"020604","ANCASH","CARHUAZ","ANTA",null,"120007","UGEL Satipo"]
[null,"020605","ANCASH","CARHUAZ","ATAQUERO",null,"120008","UGEL Tarma"]
[null,"020606","ANCASH","CARHUAZ","MARCARA",null,"120009","UGEL Yauli"]
[null,"020607","ANCASH","CARHUAZ","PARIAHUANCA",null,"120010","UGEL Pangoa"]
[null,"020608","ANCASH","CARHUAZ","SAN MIGUEL DE ACO",null,"120011","UGEL Pichanaki"]
[null,"020609","ANCASH","CARHUAZ","SHILLA",null,"120012","UGEL Rio Tambo"]
[null,"020610","ANCASH","CARHUAZ","TINCO",null,"120014","UGEL Rio Ene - Mantaro"]
[null,"020611","ANCASH","CARHUAZ","YUNGAR",null,"130000","GRE LA LIBERTAD"]
[null,"020701","ANCASH","CARLOS FERMIN FITZCARRALD","SAN LUIS",null,"130002","UGEL Viru"]
[null,"020702","ANCASH","CARLOS FERMIN FITZCARRALD","SAN NICOLAS",null,"130003","UGEL Ascope"]
[null,"020703","ANCASH","CARLOS FERMIN FITZCARRALD","YAUYA",null,"130004","UGEL Bolivar"]
[null,"020801","ANCASH","CASMA","CASMA",null,"130005","UGEL Chepen"]
[null,"020802","ANCASH","CASMA","BUENA VISTA ALTA",null,"130006","UGEL Julcan"]
[null,"020803","ANCASH","CASMA","COMANDANTE NOEL",null,"130007","UGEL Otuzco"]
[null,"020804","ANCASH","CASMA","YAUTAN",null,"130008","UGEL Pacasmayo"]
[null,"020901","ANCASH","CORONGO","CORONGO",null,"130009","UGEL Pataz"]
[null,"020902","ANCASH","CORONGO","ACO",null,"130010","UGEL Sanchez Carrion"]
[null,"020903","ANCASH","CORONGO","BAMBAS",null,"130011","UGEL Santiago de Chuco"]
[null,"020904","ANCASH","CORONGO","CUSCA",null,"130012","UGEL Gran Chimu"]
[null,"020905","ANCASH","CORONGO","LA PAMPA",null,"130014","UGEL 01 - El Porvenir"]
[null,"020906","ANCASH","CORONGO","YANAC",null,"130015","UGEL 02 - La Esperanza"]
[null,"020907","ANCASH","CORONGO","YUPAN",null,"130016","UGEL 03 - Trujillo Nor Oeste"]
[null,"021001","ANCASH","HUARI","HUARI",null,"130017","UGEL 04 - Trujillo Sur Este"]
[null,"021002","ANCASH","HUARI","ANRA",null,"140000","GRE LAMBAYEQUE"]
[null,"021003","ANCASH","HUARI","CAJAY",null,"140001","UGEL Chiclayo"]
[null,"021004","ANCASH","HUARI","CHAVIN DE HUANTAR",null,"140002","UGEL Ferreñafe"]
[null,"021005","ANCASH","HUARI","HUACACHI",null,"140003","UGEL Lambayeque"]
[null,"021006","ANCASH","HUARI","HUACCHIS",null,"150101","DRE DE LIMA METROPOLITANA"]
[null,"021007","ANCASH","HUARI","HUACHIS",null,"150102","UGEL 01 San Juan de Miraflores"]
[null,"021008","ANCASH","HUARI","HUANTAR",null,"150103","UGEL 02 Rimac"]
[null,"021009","ANCASH","HUARI","MASIN",null,"150104","UGEL 03 Breña"]
[null,"021010","ANCASH","HUARI","PAUCAS",null,"150105","UGEL 04 Comas"]
[null,"021011","ANCASH","HUARI","PONTO",null,"150106","UGEL 05 San Juan de Lurigancho"]
[null,"021012","ANCASH","HUARI","RAHUAPAMPA",null,"150107","UGEL 06 Ate"]
[null,"021013","ANCASH","HUARI","RAPAYAN",null,"150108","UGEL 07 San Borja"]
[null,"021014","ANCASH","HUARI","SAN MARCOS",null,"150200","DRE DE LIMA PROVINCIAS"]
[null,"021015","ANCASH","HUARI","SAN PEDRO DE CHANA",null,"150201","UGEL 08 Cañete"]
[null,"021016","ANCASH","HUARI","UCO",null,"150202","UGEL 09 Huaura"]
[null,"021101","ANCASH","HUARMEY","HUARMEY",null,"150203","UGEL 10 Huaral"]
[null,"021102","ANCASH","HUARMEY","COCHAPETI",null,"150204","UGEL 11 Cajatambo"]
[null,"021103","ANCASH","HUARMEY","CULEBRAS",null,"150205","UGEL 12 Canta"]
[null,"021104","ANCASH","HUARMEY","HUAYAN",null,"150206","UGEL 13 Yauyos"]
[null,"021105","ANCASH","HUARMEY","MALVAS",null,"150207","UGEL 14 Oyon"]
[null,"021201","ANCASH","HUAYLAS","CARAZ",null,"150208","UGEL 15 Huarochiri"]
[null,"021202","ANCASH","HUAYLAS","HUALLANCA",null,"150209","UGEL 16 Barranca"]
[null,"021203","ANCASH","HUAYLAS","HUATA",null,"160000","DRE LORETO"]
[null,"021204","ANCASH","HUAYLAS","HUAYLAS",null,"160001","UGEL Maynas"]
[null,"021205","ANCASH","HUAYLAS","MATO",null,"160002","UGEL Alto Amazonas-Yurimaguas"]
[null,"021206","ANCASH","HUAYLAS","PAMPAROMAS",null,"160003","UGEL Alto Amazonas-San Lorenzo"]
[null,"021207","ANCASH","HUAYLAS","PUEBLO LIBRE",null,"160004","UGEL Loreto - Nauta"]
[null,"021208","ANCASH","HUAYLAS","SANTA CRUZ",null,"160005","UGEL Ramon Castilla-Caballococha"]
[null,"021209","ANCASH","HUAYLAS","SANTO TORIBIO",null,"160006","UGEL Requena"]
[null,"021210","ANCASH","HUAYLAS","YURACMARCA",null,"160007","UGEL Ucayali-Contamana"]
[null,"021301","ANCASH","MARISCAL LUZURIAGA","PISCOBAMBA",null,"160008","UGEL Putumayo"]
[null,"021302","ANCASH","MARISCAL LUZURIAGA","CASCA",null,"170000","DRE MADRE DE DIOS"]
[null,"021303","ANCASH","MARISCAL LUZURIAGA","ELEAZAR GUZMAN BARRON",null,"170001","UGEL Tambopata"]
[null,"021304","ANCASH","MARISCAL LUZURIAGA","FIDEL OLIVAS ESCUDERO",null,"170002","UGEL Manu"]
[null,"021305","ANCASH","MARISCAL LUZURIAGA","LLAMA",null,"170003","UGEL Tahuamanu"]
[null,"021306","ANCASH","MARISCAL LUZURIAGA","LLUMPA",null,"180000","DRE MOQUEGUA"]
[null,"021307","ANCASH","MARISCAL LUZURIAGA","LUCMA",null,"180001","UGEL Mariscal Nieto"]
[null,"021308","ANCASH","MARISCAL LUZURIAGA","MUSGA",null,"180002","UGEL General Sánchez Cerro"]
[null,"021401","ANCASH","OCROS","OCROS",null,"180003","UGEL Ilo"]
[null,"021402","ANCASH","OCROS","ACAS",null,"180005","UGEL San Ignacio de Loyola - Ichuña"]
[null,"021403","ANCASH","OCROS","CAJAMARQUILLA",null,"190000","DRE PASCO"]
[null,"021404","ANCASH","OCROS","CARHUAPAMPA",null,"190001","UGEL Pasco"]
[null,"021405","ANCASH","OCROS","COCHAS",null,"190002","UGEL Daniel Alcides Carrión"]
[null,"021406","ANCASH","OCROS","CONGAS",null,"190003","UGEL Oxapampa"]
[null,"021407","ANCASH","OCROS","LLIPA",null,"190006","UGEL Puerto Bermudez"]
[null,"021408","ANCASH","OCROS","SAN CRISTOBAL DE RAJAN",null,"200000","DRE PIURA"]
[null,"021409","ANCASH","OCROS","SAN PEDRO",null,"200001","UGEL Piura"]
[null,"021410","ANCASH","OCROS","SANTIAGO DE CHILCAS",null,"200002","UGEL Tambogrande"]
[null,"021501","ANCASH","PALLASCA","CABANA",null,"200003","UGEL La Unión"]
[null,"021502","ANCASH","PALLASCA","BOLOGNESI",null,"200004","UGEL Sechura"]
[null,"021503","ANCASH","PALLASCA","CONCHUCOS",null,"200005","UGEL Ayabaca"]
[null,"021504","ANCASH","PALLASCA","HUACASCHUQUE",null,"200006","UGEL Huancabamba"]
[null,"021505","ANCASH","PALLASCA","HUANDOVAL",null,"200007","UGEL Chulucanas"]
[null,"021506","ANCASH","PALLASCA","LACABAMBA",null,"200008","UGEL Morropón"]
[null,"021507","ANCASH","PALLASCA","LLAPO",null,"200009","UGEL Paita"]
[null,"021508","ANCASH","PALLASCA","PALLASCA",null,"200010","UGEL Sullana"]
[null,"021509","ANCASH","PALLASCA","PAMPAS",null,"200011","UGEL Talara"]
[null,"021510","ANCASH","PALLASCA","SANTA ROSA",null,"200012","UGEL HUARMACA"]
[null,"021511","ANCASH","PALLASCA","TAUCA",null,"210000","DRE PUNO"]
[null,"021601","ANCASH","POMABAMBA","POMABAMBA",null,"210001","UGEL Puno"]
[null,"021602","ANCASH","POMABAMBA","HUAYLLAN",null,"210002","UGEL Azángaro"]
[null,"021603","ANCASH","POMABAMBA","PAROBAMBA",null,"210003","UGEL Carabaya"]
[null,"021604","ANCASH","POMABAMBA","QUINUABAMBA",null,"210004","UGEL El Collao"]
[null,"021701","ANCASH","RECUAY","RECUAY",null,"210005","UGEL Chucuito"]
[null,"021702","ANCASH","RECUAY","CATAC",null,"210006","UGEL Huancané"]
[null,"021703","ANCASH","RECUAY","COTAPARACO",null,"210007","UGEL San Antonio de Putina"]
[null,"021704","ANCASH","RECUAY","HUAYLLAPAMPA",null,"210008","UGEL Moho"]
[null,"021705","ANCASH","RECUAY","LLACLLIN",null,"210009","UGEL Lampa"]
[null,"021706","ANCASH","RECUAY","MARCA",null,"210010","UGEL Melgar"]
[null,"021707","ANCASH","RECUAY","PAMPAS CHICO",null,"210011","UGEL San Román"]
[null,"021708","ANCASH","RECUAY","PARARIN",null,"210012","UGEL Sandia"]
[null,"021709","ANCASH","RECUAY","TAPACOCHA",null,"210013","UGEL Yunguyo"]
[null,"021710","ANCASH","RECUAY","TICAPAMPA",null,"210014","UGEL Crucero"]
[null,"021801","ANCASH","SANTA","CHIMBOTE",null,"220000","DRE SAN MARTIN"]
[null,"021802","ANCASH","SANTA","CACERES DEL PERU",null,"220001","UGEL Moyobamba"]
[null,"021803","ANCASH","SANTA","COISHCO",null,"220002","UGEL Bellavista"]
[null,"021804","ANCASH","SANTA","MACATE",null,"220003","UGEL Huallaga"]
[null,"021805","ANCASH","SANTA","MORO",null,"220004","UGEL Lamas"]
[null,"021806","ANCASH","SANTA","NEPEÑA",null,"220005","UGEL El Dorado"]
[null,"021807","ANCASH","SANTA","SAMANCO",null,"220006","UGEL Mariscal Cáceres"]
[null,"021808","ANCASH","SANTA","SANTA",null,"220007","UGEL Picota"]
[null,"021809","ANCASH","SANTA","NUEVO CHIMBOTE",null,"220008","UGEL Rioja"]
[null,"021901","ANCASH","SIHUAS","SIHUAS",null,"220009","UGEL San Martín"]
[null,"021902","ANCASH","SIHUAS","ACOBAMBA",null,"220010","UGEL Tocache"]
[null,"021903","ANCASH","SIHUAS","ALFONSO UGARTE",null,"230000","DRE TACNA"]
[null,"021904","ANCASH","SIHUAS","CASHAPAMPA",null,"230001","UGEL Tacna"]
[null,"021905","ANCASH","SIHUAS","CHINGALPO",null,"230002","UGEL Jorge Basadre"]
[null,"021906","ANCASH","SIHUAS","HUAYLLABAMBA",null,"230003","UGEL Tarata"]
[null,"021907","ANCASH","SIHUAS","QUICHES",null,"230004","UGEL Candarave"]
[null,"021908","ANCASH","SIHUAS","RAGASH",null,"240000","DRE TUMBES"]
[null,"021909","ANCASH","SIHUAS","SAN JUAN",null,"240001","UGEL Tumbes"]
[null,"021910","ANCASH","SIHUAS","SICSIBAMBA",null,"240002","UGEL Contralmirante Villar"]
[null,"022001","ANCASH","YUNGAY","YUNGAY",null,"240003","UGEL Zarumilla"]
[null,"022002","ANCASH","YUNGAY","CASCAPARA",null,"250000","DRE UCAYALI"]
[null,"022003","ANCASH","YUNGAY","MANCOS",null,"250001","UGEL Coronel Portillo"]
[null,"022004","ANCASH","YUNGAY","MATACOTO",null,"250002","UGEL Atalaya"]
[null,"022005","ANCASH","YUNGAY","QUILLO",null,"250003","UGEL Padre Abad"]
[null,"022006","ANCASH","YUNGAY","RANRAHIRCA",null,"250004","UGEL Purus"]
[null,"022007","ANCASH","YUNGAY","SHUPLUY"]
[null,"022008","ANCASH","YUNGAY","YANAMA"]
[null,"030101","APURIMAC","ABANCAY","ABANCAY"]
[null,"030102","APURIMAC","ABANCAY","CHACOCHE"]
[null,"030103","APURIMAC","ABANCAY","CIRCA"]
[null,"030104","APURIMAC","ABANCAY","CURAHUASI"]
[null,"030105","APURIMAC","ABANCAY","HUANIPACA"]
[null,"030106","APURIMAC","ABANCAY","LAMBRAMA"]
[null,"030107","APURIMAC","ABANCAY","PICHIRHUA"]
[null,"030108","APURIMAC","ABANCAY","SAN PEDRO DE CACHORA"]
[null,"030109","APURIMAC","ABANCAY","TAMBURCO"]
[null,"030201","APURIMAC","ANDAHUAYLAS","ANDAHUAYLAS"]
[null,"030202","APURIMAC","ANDAHUAYLAS","ANDARAPA"]
[null,"030203","APURIMAC","ANDAHUAYLAS","CHIARA"]
[null,"030204","APURIMAC","ANDAHUAYLAS","HUANCARAMA"]
[null,"030205","APURIMAC","ANDAHUAYLAS","HUANCARAY"]
[null,"030206","APURIMAC","ANDAHUAYLAS","HUAYANA"]
[null,"030207","APURIMAC","ANDAHUAYLAS","KISHUARA"]
[null,"030208","APURIMAC","ANDAHUAYLAS","PACOBAMBA"]
[null,"030209","APURIMAC","ANDAHUAYLAS","PACUCHA"]
[null,"030210","APURIMAC","ANDAHUAYLAS","PAMPACHIRI"]
[null,"030211","APURIMAC","ANDAHUAYLAS","POMACOCHA"]
[null,"030212","APURIMAC","ANDAHUAYLAS","SAN ANTONIO DE CACHI"]
[null,"030213","APURIMAC","ANDAHUAYLAS","SAN JERONIMO"]
[null,"030214","APURIMAC","ANDAHUAYLAS","SAN MIGUEL DE CHACCRAMPA"]
[null,"030215","APURIMAC","ANDAHUAYLAS","SANTA MARIA DE CHICMO"]
[null,"030216","APURIMAC","ANDAHUAYLAS","TALAVERA"]
[null,"030217","APURIMAC","ANDAHUAYLAS","TUMAY HUARACA"]
[null,"030218","APURIMAC","ANDAHUAYLAS","TURPO"]
[null,"030219","APURIMAC","ANDAHUAYLAS","KAQUIABAMBA"]
[null,"030220","APURIMAC","ANDAHUAYLAS","JOSE MARIA ARGUEDAS"]
[null,"030301","APURIMAC","ANTABAMBA","ANTABAMBA"]
[null,"030302","APURIMAC","ANTABAMBA","EL ORO"]
[null,"030303","APURIMAC","ANTABAMBA","HUAQUIRCA"]
[null,"030304","APURIMAC","ANTABAMBA","JUAN ESPINOZA MEDRANO"]
[null,"030305","APURIMAC","ANTABAMBA","OROPESA"]
[null,"030306","APURIMAC","ANTABAMBA","PACHACONAS"]
[null,"030307","APURIMAC","ANTABAMBA","SABAINO"]
[null,"030401","APURIMAC","AYMARAES","CHALHUANCA"]
[null,"030402","APURIMAC","AYMARAES","CAPAYA"]
[null,"030403","APURIMAC","AYMARAES","CARAYBAMBA"]
[null,"030404","APURIMAC","AYMARAES","CHAPIMARCA"]
[null,"030405","APURIMAC","AYMARAES","COLCABAMBA"]
[null,"030406","APURIMAC","AYMARAES","COTARUSE"]
[null,"030407","APURIMAC","AYMARAES","IHUAYLLO"]
[null,"030408","APURIMAC","AYMARAES","JUSTO APU SAHUARAURA"]
[null,"030409","APURIMAC","AYMARAES","LUCRE"]
[null,"030410","APURIMAC","AYMARAES","POCOHUANCA"]
[null,"030411","APURIMAC","AYMARAES","SAN JUAN DE CHACÑA"]
[null,"030412","APURIMAC","AYMARAES","SAÑAYCA"]
[null,"030413","APURIMAC","AYMARAES","SORAYA"]
[null,"030414","APURIMAC","AYMARAES","TAPAIRIHUA"]
[null,"030415","APURIMAC","AYMARAES","TINTAY"]
[null,"030416","APURIMAC","AYMARAES","TORAYA"]
[null,"030417","APURIMAC","AYMARAES","YANACA"]
[null,"030501","APURIMAC","COTABAMBAS","TAMBOBAMBA"]
[null,"030502","APURIMAC","COTABAMBAS","COTABAMBAS"]
[null,"030503","APURIMAC","COTABAMBAS","COYLLURQUI"]
[null,"030504","APURIMAC","COTABAMBAS","HAQUIRA"]
[null,"030505","APURIMAC","COTABAMBAS","MARA"]
[null,"030506","APURIMAC","COTABAMBAS","CHALLHUAHUACHO"]
[null,"030601","APURIMAC","CHINCHEROS","CHINCHEROS"]
[null,"030602","APURIMAC","CHINCHEROS","ANCO_HUALLO"]
[null,"030603","APURIMAC","CHINCHEROS","COCHARCAS"]
[null,"030604","APURIMAC","CHINCHEROS","HUACCANA"]
[null,"030605","APURIMAC","CHINCHEROS","OCOBAMBA"]
[null,"030606","APURIMAC","CHINCHEROS","ONGOY"]
[null,"030607","APURIMAC","CHINCHEROS","URANMARCA"]
[null,"030608","APURIMAC","CHINCHEROS","RANRACANCHA"]
[null,"030609","APURIMAC","CHINCHEROS","ROCCHACC"]
[null,"030610","APURIMAC","CHINCHEROS","EL PORVENIR"]
[null,"030611","APURIMAC","CHINCHEROS","LOS CHANKAS"]
[null,"030612","APURIMAC","CHINCHEROS","AHUAYRO"]
[null,"030701","APURIMAC","GRAU","CHUQUIBAMBILLA"]
[null,"030702","APURIMAC","GRAU","CURPAHUASI"]
[null,"030703","APURIMAC","GRAU","GAMARRA"]
[null,"030704","APURIMAC","GRAU","HUAYLLATI"]
[null,"030705","APURIMAC","GRAU","MAMARA"]
[null,"030706","APURIMAC","GRAU","MICAELA BASTIDAS"]
[null,"030707","APURIMAC","GRAU","PATAYPAMPA"]
[null,"030708","APURIMAC","GRAU","PROGRESO"]
[null,"030709","APURIMAC","GRAU","SAN ANTONIO"]
[null,"030710","APURIMAC","GRAU","SANTA ROSA"]
[null,"030711","APURIMAC","GRAU","TURPAY"]
[null,"030712","APURIMAC","GRAU","VILCABAMBA"]
[null,"030713","APURIMAC","GRAU","VIRUNDO"]
[null,"030714","APURIMAC","GRAU","CURASCO"]
[null,"040101","AREQUIPA","AREQUIPA","AREQUIPA"]
[null,"040102","AREQUIPA","AREQUIPA","ALTO SELVA ALEGRE"]
[null,"040103","AREQUIPA","AREQUIPA","CAYMA"]
[null,"040104","AREQUIPA","AREQUIPA","CERRO COLORADO"]
[null,"040105","AREQUIPA","AREQUIPA","CHARACATO"]
[null,"040106","AREQUIPA","AREQUIPA","CHIGUATA"]
[null,"040107","AREQUIPA","AREQUIPA","JACOBO HUNTER"]
[null,"040108","AREQUIPA","AREQUIPA","LA JOYA"]
[null,"040109","AREQUIPA","AREQUIPA","MARIANO MELGAR"]
[null,"040110","AREQUIPA","AREQUIPA","MIRAFLORES"]
[null,"040111","AREQUIPA","AREQUIPA","MOLLEBAYA"]
[null,"040112","AREQUIPA","AREQUIPA","PAUCARPATA"]
[null,"040113","AREQUIPA","AREQUIPA","POCSI"]
[null,"040114","AREQUIPA","AREQUIPA","POLOBAYA"]
[null,"040115","AREQUIPA","AREQUIPA","QUEQUEÑA"]
[null,"040116","AREQUIPA","AREQUIPA","SABANDIA"]
[null,"040117","AREQUIPA","AREQUIPA","SACHACA"]
[null,"040118","AREQUIPA","AREQUIPA","SAN JUAN DE SIGUAS"]
[null,"040119","AREQUIPA","AREQUIPA","SAN JUAN DE TARUCANI"]
[null,"040120","AREQUIPA","AREQUIPA","SANTA ISABEL DE SIGUAS"]
[null,"040121","AREQUIPA","AREQUIPA","SANTA RITA DE SIGUAS"]
[null,"040122","AREQUIPA","AREQUIPA","SOCABAYA"]
[null,"040123","AREQUIPA","AREQUIPA","TIABAYA"]
[null,"040124","AREQUIPA","AREQUIPA","UCHUMAYO"]
[null,"040125","AREQUIPA","AREQUIPA","VITOR"]
[null,"040126","AREQUIPA","AREQUIPA","YANAHUARA"]
[null,"040127","AREQUIPA","AREQUIPA","YARABAMBA"]
[null,"040128","AREQUIPA","AREQUIPA","YURA"]
[null,"040129","AREQUIPA","AREQUIPA","JOSE LUIS BUSTAMANTE Y RIVERO"]
[null,"040201","AREQUIPA","CAMANA","CAMANA"]
[null,"040202","AREQUIPA","CAMANA","JOSE MARIA QUIMPER"]
[null,"040203","AREQUIPA","CAMANA","MARIANO NICOLAS VALCARCEL"]
[null,"040204","AREQUIPA","CAMANA","MARISCAL CACERES"]
[null,"040205","AREQUIPA","CAMANA","NICOLAS DE PIEROLA"]
[null,"040206","AREQUIPA","CAMANA","OCOÑA"]
[null,"040207","AREQUIPA","CAMANA","QUILCA"]
[null,"040208","AREQUIPA","CAMANA","SAMUEL PASTOR"]
[null,"040301","AREQUIPA","CARAVELI","CARAVELI"]
[null,"040302","AREQUIPA","CARAVELI","ACARI"]
[null,"040303","AREQUIPA","CARAVELI","ATICO"]
[null,"040304","AREQUIPA","CARAVELI","ATIQUIPA"]
[null,"040305","AREQUIPA","CARAVELI","BELLA UNION"]
[null,"040306","AREQUIPA","CARAVELI","CAHUACHO"]
[null,"040307","AREQUIPA","CARAVELI","CHALA"]
[null,"040308","AREQUIPA","CARAVELI","CHAPARRA"]
[null,"040309","AREQUIPA","CARAVELI","HUANUHUANU"]
[null,"040310","AREQUIPA","CARAVELI","JAQUI"]
[null,"040311","AREQUIPA","CARAVELI","LOMAS"]
[null,"040312","AREQUIPA","CARAVELI","QUICACHA"]
[null,"040313","AREQUIPA","CARAVELI","YAUCA"]
[null,"040401","AREQUIPA","CASTILLA","APLAO"]
[null,"040402","AREQUIPA","CASTILLA","ANDAGUA"]
[null,"040403","AREQUIPA","CASTILLA","AYO"]
[null,"040404","AREQUIPA","CASTILLA","CHACHAS"]
[null,"040405","AREQUIPA","CASTILLA","CHILCAYMARCA"]
[null,"040406","AREQUIPA","CASTILLA","CHOCO"]
[null,"040407","AREQUIPA","CASTILLA","HUANCARQUI"]
[null,"040408","AREQUIPA","CASTILLA","MACHAGUAY"]
[null,"040409","AREQUIPA","CASTILLA","ORCOPAMPA"]
[null,"040410","AREQUIPA","CASTILLA","PAMPACOLCA"]
[null,"040411","AREQUIPA","CASTILLA","TIPAN"]
[null,"040412","AREQUIPA","CASTILLA","UÑON"]
[null,"040413","AREQUIPA","CASTILLA","URACA"]
[null,"040414","AREQUIPA","CASTILLA","VIRACO"]
[null,"040501","AREQUIPA","CAYLLOMA","CHIVAY"]
[null,"040502","AREQUIPA","CAYLLOMA","ACHOMA"]
[null,"040503","AREQUIPA","CAYLLOMA","CABANACONDE"]
[null,"040504","AREQUIPA","CAYLLOMA","CALLALLI"]
[null,"040505","AREQUIPA","CAYLLOMA","CAYLLOMA"]
[null,"040506","AREQUIPA","CAYLLOMA","COPORAQUE"]
[null,"040507","AREQUIPA","CAYLLOMA","HUAMBO"]
[null,"040508","AREQUIPA","CAYLLOMA","HUANCA"]
[null,"040509","AREQUIPA","CAYLLOMA","ICHUPAMPA"]
[null,"040510","AREQUIPA","CAYLLOMA","LARI"]
[null,"040511","AREQUIPA","CAYLLOMA","LLUTA"]
[null,"040512","AREQUIPA","CAYLLOMA","MACA"]
[null,"040513","AREQUIPA","CAYLLOMA","MADRIGAL"]
[null,"040514","AREQUIPA","CAYLLOMA","SAN ANTONIO DE CHUCA"]
[null,"040515","AREQUIPA","CAYLLOMA","SIBAYO"]
[null,"040516","AREQUIPA","CAYLLOMA","TAPAY"]
[null,"040517","AREQUIPA","CAYLLOMA","TISCO"]
[null,"040518","AREQUIPA","CAYLLOMA","TUTI"]
[null,"040519","AREQUIPA","CAYLLOMA","YANQUE"]
[null,"040520","AREQUIPA","CAYLLOMA","MAJES"]
[null,"040601","AREQUIPA","CONDESUYOS","CHUQUIBAMBA"]
[null,"040602","AREQUIPA","CONDESUYOS","ANDARAY"]
[null,"040603","AREQUIPA","CONDESUYOS","CAYARANI"]
[null,"040604","AREQUIPA","CONDESUYOS","CHICHAS"]
[null,"040605","AREQUIPA","CONDESUYOS","IRAY"]
[null,"040606","AREQUIPA","CONDESUYOS","RIO GRANDE"]
[null,"040607","AREQUIPA","CONDESUYOS","SALAMANCA"]
[null,"040608","AREQUIPA","CONDESUYOS","YANAQUIHUA"]
[null,"040701","AREQUIPA","ISLAY","MOLLENDO"]
[null,"040702","AREQUIPA","ISLAY","COCACHACRA"]
[null,"040703","AREQUIPA","ISLAY","DEAN VALDIVIA"]
[null,"040704","AREQUIPA","ISLAY","ISLAY"]
[null,"040705","AREQUIPA","ISLAY","MEJIA"]
[null,"040706","AREQUIPA","ISLAY","PUNTA DE BOMBON"]
[null,"040801","AREQUIPA","LA UNION","COTAHUASI"]
[null,"040802","AREQUIPA","LA UNION","ALCA"]
[null,"040803","AREQUIPA","LA UNION","CHARCANA"]
[null,"040804","AREQUIPA","LA UNION","HUAYNACOTAS"]
[null,"040805","AREQUIPA","LA UNION","PAMPAMARCA"]
[null,"040806","AREQUIPA","LA UNION","PUYCA"]
[null,"040807","AREQUIPA","LA UNION","QUECHUALLA"]
[null,"040808","AREQUIPA","LA UNION","SAYLA"]
[null,"040809","AREQUIPA","LA UNION","TAURIA"]
[null,"040810","AREQUIPA","LA UNION","TOMEPAMPA"]
[null,"040811","AREQUIPA","LA UNION","TORO"]
[null,"050101","AYACUCHO","HUAMANGA","AYACUCHO"]
[null,"050102","AYACUCHO","HUAMANGA","ACOCRO"]
[null,"050103","AYACUCHO","HUAMANGA","ACOS VINCHOS"]
[null,"050104","AYACUCHO","HUAMANGA","CARMEN ALTO"]
[null,"050105","AYACUCHO","HUAMANGA","CHIARA"]
[null,"050106","AYACUCHO","HUAMANGA","OCROS"]
[null,"050107","AYACUCHO","HUAMANGA","PACAYCASA"]
[null,"050108","AYACUCHO","HUAMANGA","QUINUA"]
[null,"050109","AYACUCHO","HUAMANGA","SAN JOSE DE TICLLAS"]
[null,"050110","AYACUCHO","HUAMANGA","SAN JUAN BAUTISTA"]
[null,"050111","AYACUCHO","HUAMANGA","SANTIAGO DE PISCHA"]
[null,"050112","AYACUCHO","HUAMANGA","SOCOS"]
[null,"050113","AYACUCHO","HUAMANGA","TAMBILLO"]
[null,"050114","AYACUCHO","HUAMANGA","VINCHOS"]
[null,"050115","AYACUCHO","HUAMANGA","JESUS NAZARENO"]
[null,"050116","AYACUCHO","HUAMANGA","ANDRES AVELINO CACERES DORREGARAY"]
[null,"050201","AYACUCHO","CANGALLO","CANGALLO"]
[null,"050202","AYACUCHO","CANGALLO","CHUSCHI"]
[null,"050203","AYACUCHO","CANGALLO","LOS MOROCHUCOS"]
[null,"050204","AYACUCHO","CANGALLO","MARIA PARADO DE BELLIDO"]
[null,"050205","AYACUCHO","CANGALLO","PARAS"]
[null,"050206","AYACUCHO","CANGALLO","TOTOS"]
[null,"050301","AYACUCHO","HUANCA SANCOS","SANCOS"]
[null,"050302","AYACUCHO","HUANCA SANCOS","CARAPO"]
[null,"050303","AYACUCHO","HUANCA SANCOS","SACSAMARCA"]
[null,"050304","AYACUCHO","HUANCA SANCOS","SANTIAGO DE LUCANAMARCA"]
[null,"050401","AYACUCHO","HUANTA","HUANTA"]
[null,"050402","AYACUCHO","HUANTA","AYAHUANCO"]
[null,"050403","AYACUCHO","HUANTA","HUAMANGUILLA"]
[null,"050404","AYACUCHO","HUANTA","IGUAIN"]
[null,"050405","AYACUCHO","HUANTA","LURICOCHA"]
[null,"050406","AYACUCHO","HUANTA","SANTILLANA"]
[null,"050407","AYACUCHO","HUANTA","SIVIA"]
[null,"050408","AYACUCHO","HUANTA","LLOCHEGUA"]
[null,"050409","AYACUCHO","HUANTA","CANAYRE"]
[null,"050410","AYACUCHO","HUANTA","UCHURACCAY"]
[null,"050411","AYACUCHO","HUANTA","PUCACOLPA"]
[null,"050412","AYACUCHO","HUANTA","CHACA"]
[null,"050413","AYACUCHO","HUANTA","PUTIS"]
[null,"050501","AYACUCHO","LA MAR","SAN MIGUEL"]
[null,"050502","AYACUCHO","LA MAR","ANCO"]
[null,"050503","AYACUCHO","LA MAR","AYNA"]
[null,"050504","AYACUCHO","LA MAR","CHILCAS"]
[null,"050505","AYACUCHO","LA MAR","CHUNGUI"]
[null,"050506","AYACUCHO","LA MAR","LUIS CARRANZA"]
[null,"050507","AYACUCHO","LA MAR","SANTA ROSA"]
[null,"050508","AYACUCHO","LA MAR","TAMBO"]
[null,"050509","AYACUCHO","LA MAR","SAMUGARI"]
[null,"050510","AYACUCHO","LA MAR","ANCHIHUAY"]
[null,"050511","AYACUCHO","LA MAR","ORONCCOY"]
[null,"050512","AYACUCHO","LA MAR","UNION PROGRESO"]
[null,"050513","AYACUCHO","LA MAR","RIO MAGDALENA"]
[null,"050514","AYACUCHO","LA MAR","NINABAMBA"]
[null,"050515","AYACUCHO","LA MAR","PATIBAMBA"]
[null,"050601","AYACUCHO","LUCANAS","PUQUIO"]
[null,"050602","AYACUCHO","LUCANAS","AUCARA"]
[null,"050603","AYACUCHO","LUCANAS","CABANA"]
[null,"050604","AYACUCHO","LUCANAS","CARMEN SALCEDO"]
[null,"050605","AYACUCHO","LUCANAS","CHAVIÑA"]
[null,"050606","AYACUCHO","LUCANAS","CHIPAO"]
[null,"050607","AYACUCHO","LUCANAS","HUAC-HUAS"]
[null,"050608","AYACUCHO","LUCANAS","LARAMATE"]
[null,"050609","AYACUCHO","LUCANAS","LEONCIO PRADO"]
[null,"050610","AYACUCHO","LUCANAS","LLAUTA"]
[null,"050611","AYACUCHO","LUCANAS","LUCANAS"]
[null,"050612","AYACUCHO","LUCANAS","OCAÑA"]
[null,"050613","AYACUCHO","LUCANAS","OTOCA"]
[null,"050614","AYACUCHO","LUCANAS","SAISA"]
[null,"050615","AYACUCHO","LUCANAS","SAN CRISTOBAL"]
[null,"050616","AYACUCHO","LUCANAS","SAN JUAN"]
[null,"050617","AYACUCHO","LUCANAS","SAN PEDRO"]
[null,"050618","AYACUCHO","LUCANAS","SAN PEDRO DE PALCO"]
[null,"050619","AYACUCHO","LUCANAS","SANCOS"]
[null,"050620","AYACUCHO","LUCANAS","SANTA ANA DE HUAYCAHUACHO"]
[null,"050621","AYACUCHO","LUCANAS","SANTA LUCIA"]
[null,"050701","AYACUCHO","PARINACOCHAS","CORACORA"]
[null,"050702","AYACUCHO","PARINACOCHAS","CHUMPI"]
[null,"050703","AYACUCHO","PARINACOCHAS","CORONEL CASTAÑEDA"]
[null,"050704","AYACUCHO","PARINACOCHAS","PACAPAUSA"]
[null,"050705","AYACUCHO","PARINACOCHAS","PULLO"]
[null,"050706","AYACUCHO","PARINACOCHAS","PUYUSCA"]
[null,"050707","AYACUCHO","PARINACOCHAS","SAN FRANCISCO DE RAVACAYCO"]
[null,"050708","AYACUCHO","PARINACOCHAS","UPAHUACHO"]
[null,"050801","AYACUCHO","PAUCAR DEL SARA SARA","PAUSA"]
[null,"050802","AYACUCHO","PAUCAR DEL SARA SARA","COLTA"]
[null,"050803","AYACUCHO","PAUCAR DEL SARA SARA","CORCULLA"]
[null,"050804","AYACUCHO","PAUCAR DEL SARA SARA","LAMPA"]
[null,"050805","AYACUCHO","PAUCAR DEL SARA SARA","MARCABAMBA"]
[null,"050806","AYACUCHO","PAUCAR DEL SARA SARA","OYOLO"]
[null,"050807","AYACUCHO","PAUCAR DEL SARA SARA","PARARCA"]
[null,"050808","AYACUCHO","PAUCAR DEL SARA SARA","SAN JAVIER DE ALPABAMBA"]
[null,"050809","AYACUCHO","PAUCAR DEL SARA SARA","SAN JOSE DE USHUA"]
[null,"050810","AYACUCHO","PAUCAR DEL SARA SARA","SARA SARA"]
[null,"050901","AYACUCHO","SUCRE","QUEROBAMBA"]
[null,"050902","AYACUCHO","SUCRE","BELEN"]
[null,"050903","AYACUCHO","SUCRE","CHALCOS"]
[null,"050904","AYACUCHO","SUCRE","CHILCAYOC"]
[null,"050905","AYACUCHO","SUCRE","HUACAÑA"]
[null,"050906","AYACUCHO","SUCRE","MORCOLLA"]
[null,"050907","AYACUCHO","SUCRE","PAICO"]
[null,"050908","AYACUCHO","SUCRE","SAN PEDRO DE LARCAY"]
[null,"050909","AYACUCHO","SUCRE","SAN SALVADOR DE QUIJE"]
[null,"050910","AYACUCHO","SUCRE","SANTIAGO DE PAUCARAY"]
[null,"050911","AYACUCHO","SUCRE","SORAS"]
[null,"051001","AYACUCHO","VICTOR FAJARDO","HUANCAPI"]
[null,"051002","AYACUCHO","VICTOR FAJARDO","ALCAMENCA"]
[null,"051003","AYACUCHO","VICTOR FAJARDO","APONGO"]
[null,"051004","AYACUCHO","VICTOR FAJARDO","ASQUIPATA"]
[null,"051005","AYACUCHO","VICTOR FAJARDO","CANARIA"]
[null,"051006","AYACUCHO","VICTOR FAJARDO","CAYARA"]
[null,"051007","AYACUCHO","VICTOR FAJARDO","COLCA"]
[null,"051008","AYACUCHO","VICTOR FAJARDO","HUAMANQUIQUIA"]
[null,"051009","AYACUCHO","VICTOR FAJARDO","HUANCARAYLLA"]
[null,"051010","AYACUCHO","VICTOR FAJARDO","HUALLA"]
[null,"051011","AYACUCHO","VICTOR FAJARDO","SARHUA"]
[null,"051012","AYACUCHO","VICTOR FAJARDO","VILCANCHOS"]
[null,"051101","AYACUCHO","VILCAS HUAMAN","VILCAS HUAMAN"]
[null,"051102","AYACUCHO","VILCAS HUAMAN","ACCOMARCA"]
[null,"051103","AYACUCHO","VILCAS HUAMAN","CARHUANCA"]
[null,"051104","AYACUCHO","VILCAS HUAMAN","CONCEPCION"]
[null,"051105","AYACUCHO","VILCAS HUAMAN","HUAMBALPA"]
[null,"051106","AYACUCHO","VILCAS HUAMAN","INDEPENDENCIA"]
[null,"051107","AYACUCHO","VILCAS HUAMAN","SAURAMA"]
[null,"051108","AYACUCHO","VILCAS HUAMAN","VISCHONGO"]
[null,"060101","CAJAMARCA","CAJAMARCA","CAJAMARCA"]
[null,"060102","CAJAMARCA","CAJAMARCA","ASUNCION"]
[null,"060103","CAJAMARCA","CAJAMARCA","CHETILLA"]
[null,"060104","CAJAMARCA","CAJAMARCA","COSPAN"]
[null,"060105","CAJAMARCA","CAJAMARCA","ENCAÑADA"]
[null,"060106","CAJAMARCA","CAJAMARCA","JESUS"]
[null,"060107","CAJAMARCA","CAJAMARCA","LLACANORA"]
[null,"060108","CAJAMARCA","CAJAMARCA","LOS BAÑOS DEL INCA"]
[null,"060109","CAJAMARCA","CAJAMARCA","MAGDALENA"]
[null,"060110","CAJAMARCA","CAJAMARCA","MATARA"]
[null,"060111","CAJAMARCA","CAJAMARCA","NAMORA"]
[null,"060112","CAJAMARCA","CAJAMARCA","SAN JUAN"]
[null,"060201","CAJAMARCA","CAJABAMBA","CAJABAMBA"]
[null,"060202","CAJAMARCA","CAJABAMBA","CACHACHI"]
[null,"060203","CAJAMARCA","CAJABAMBA","CONDEBAMBA"]
[null,"060204","CAJAMARCA","CAJABAMBA","SITACOCHA"]
[null,"060301","CAJAMARCA","CELENDIN","CELENDIN"]
[null,"060302","CAJAMARCA","CELENDIN","CHUMUCH"]
[null,"060303","CAJAMARCA","CELENDIN","CORTEGANA"]
[null,"060304","CAJAMARCA","CELENDIN","HUASMIN"]
[null,"060305","CAJAMARCA","CELENDIN","JORGE CHAVEZ"]
[null,"060306","CAJAMARCA","CELENDIN","JOSE GALVEZ"]
[null,"060307","CAJAMARCA","CELENDIN","MIGUEL IGLESIAS"]
[null,"060308","CAJAMARCA","CELENDIN","OXAMARCA"]
[null,"060309","CAJAMARCA","CELENDIN","SOROCHUCO"]
[null,"060310","CAJAMARCA","CELENDIN","SUCRE"]
[null,"060311","CAJAMARCA","CELENDIN","UTCO"]
[null,"060312","CAJAMARCA","CELENDIN","LA LIBERTAD DE PALLAN"]
[null,"060401","CAJAMARCA","CHOTA","CHOTA"]
[null,"060402","CAJAMARCA","CHOTA","ANGUIA"]
[null,"060403","CAJAMARCA","CHOTA","CHADIN"]
[null,"060404","CAJAMARCA","CHOTA","CHIGUIRIP"]
[null,"060405","CAJAMARCA","CHOTA","CHIMBAN"]
[null,"060406","CAJAMARCA","CHOTA","CHOROPAMPA"]
[null,"060407","CAJAMARCA","CHOTA","COCHABAMBA"]
[null,"060408","CAJAMARCA","CHOTA","CONCHAN"]
[null,"060409","CAJAMARCA","CHOTA","HUAMBOS"]
[null,"060410","CAJAMARCA","CHOTA","LAJAS"]
[null,"060411","CAJAMARCA","CHOTA","LLAMA"]
[null,"060412","CAJAMARCA","CHOTA","MIRACOSTA"]
[null,"060413","CAJAMARCA","CHOTA","PACCHA"]
[null,"060414","CAJAMARCA","CHOTA","PION"]
[null,"060415","CAJAMARCA","CHOTA","QUEROCOTO"]
[null,"060416","CAJAMARCA","CHOTA","SAN JUAN DE LICUPIS"]
[null,"060417","CAJAMARCA","CHOTA","TACABAMBA"]
[null,"060418","CAJAMARCA","CHOTA","TOCMOCHE"]
[null,"060419","CAJAMARCA","CHOTA","CHALAMARCA"]
[null,"060501","CAJAMARCA","CONTUMAZA","CONTUMAZA"]
[null,"060502","CAJAMARCA","CONTUMAZA","CHILETE"]
[null,"060503","CAJAMARCA","CONTUMAZA","CUPISNIQUE"]
[null,"060504","CAJAMARCA","CONTUMAZA","GUZMANGO"]
[null,"060505","CAJAMARCA","CONTUMAZA","SAN BENITO"]
[null,"060506","CAJAMARCA","CONTUMAZA","SANTA CRUZ DE TOLEDO"]
[null,"060507","CAJAMARCA","CONTUMAZA","TANTARICA"]
[null,"060508","CAJAMARCA","CONTUMAZA","YONAN"]
[null,"060601","CAJAMARCA","CUTERVO","CUTERVO"]
[null,"060602","CAJAMARCA","CUTERVO","CALLAYUC"]
[null,"060603","CAJAMARCA","CUTERVO","CHOROS"]
[null,"060604","CAJAMARCA","CUTERVO","CUJILLO"]
[null,"060605","CAJAMARCA","CUTERVO","LA RAMADA"]
[null,"060606","CAJAMARCA","CUTERVO","PIMPINGOS"]
[null,"060607","CAJAMARCA","CUTERVO","QUEROCOTILLO"]
[null,"060608","CAJAMARCA","CUTERVO","SAN ANDRES DE CUTERVO"]
[null,"060609","CAJAMARCA","CUTERVO","SAN JUAN DE CUTERVO"]
[null,"060610","CAJAMARCA","CUTERVO","SAN LUIS DE LUCMA"]
[null,"060611","CAJAMARCA","CUTERVO","SANTA CRUZ"]
[null,"060612","CAJAMARCA","CUTERVO","SANTO DOMINGO DE LA CAPILLA"]
[null,"060613","CAJAMARCA","CUTERVO","SANTO TOMAS"]
[null,"060614","CAJAMARCA","CUTERVO","SOCOTA"]
[null,"060615","CAJAMARCA","CUTERVO","TORIBIO CASANOVA"]
[null,"060701","CAJAMARCA","HUALGAYOC","BAMBAMARCA"]
[null,"060702","CAJAMARCA","HUALGAYOC","CHUGUR"]
[null,"060703","CAJAMARCA","HUALGAYOC","HUALGAYOC"]
[null,"060801","CAJAMARCA","JAEN","JAEN"]
[null,"060802","CAJAMARCA","JAEN","BELLAVISTA"]
[null,"060803","CAJAMARCA","JAEN","CHONTALI"]
[null,"060804","CAJAMARCA","JAEN","COLASAY"]
[null,"060805","CAJAMARCA","JAEN","HUABAL"]
[null,"060806","CAJAMARCA","JAEN","LAS PIRIAS"]
[null,"060807","CAJAMARCA","JAEN","POMAHUACA"]
[null,"060808","CAJAMARCA","JAEN","PUCARA"]
[null,"060809","CAJAMARCA","JAEN","SALLIQUE"]
[null,"060810","CAJAMARCA","JAEN","SAN FELIPE"]
[null,"060811","CAJAMARCA","JAEN","SAN JOSE DEL ALTO"]
[null,"060812","CAJAMARCA","JAEN","SANTA ROSA"]
[null,"060901","CAJAMARCA","SAN IGNACIO","SAN IGNACIO"]
[null,"060902","CAJAMARCA","SAN IGNACIO","CHIRINOS"]
[null,"060903","CAJAMARCA","SAN IGNACIO","HUARANGO"]
[null,"060904","CAJAMARCA","SAN IGNACIO","LA COIPA"]
[null,"060905","CAJAMARCA","SAN IGNACIO","NAMBALLE"]
[null,"060906","CAJAMARCA","SAN IGNACIO","SAN JOSE DE LOURDES"]
[null,"060907","CAJAMARCA","SAN IGNACIO","TABACONAS"]
[null,"061001","CAJAMARCA","SAN MARCOS","PEDRO GALVEZ"]
[null,"061002","CAJAMARCA","SAN MARCOS","CHANCAY"]
[null,"061003","CAJAMARCA","SAN MARCOS","EDUARDO VILLANUEVA"]
[null,"061004","CAJAMARCA","SAN MARCOS","GREGORIO PITA"]
[null,"061005","CAJAMARCA","SAN MARCOS","ICHOCAN"]
[null,"061006","CAJAMARCA","SAN MARCOS","JOSE MANUEL QUIROZ"]
[null,"061007","CAJAMARCA","SAN MARCOS","JOSE SABOGAL"]
[null,"061101","CAJAMARCA","SAN MIGUEL","SAN MIGUEL"]
[null,"061102","CAJAMARCA","SAN MIGUEL","BOLIVAR"]
[null,"061103","CAJAMARCA","SAN MIGUEL","CALQUIS"]
[null,"061104","CAJAMARCA","SAN MIGUEL","CATILLUC"]
[null,"061105","CAJAMARCA","SAN MIGUEL","EL PRADO"]
[null,"061106","CAJAMARCA","SAN MIGUEL","LA FLORIDA"]
[null,"061107","CAJAMARCA","SAN MIGUEL","LLAPA"]
[null,"061108","CAJAMARCA","SAN MIGUEL","NANCHOC"]
[null,"061109","CAJAMARCA","SAN MIGUEL","NIEPOS"]
[null,"061110","CAJAMARCA","SAN MIGUEL","SAN GREGORIO"]
[null,"061111","CAJAMARCA","SAN MIGUEL","SAN SILVESTRE DE COCHAN"]
[null,"061112","CAJAMARCA","SAN MIGUEL","TONGOD"]
[null,"061113","CAJAMARCA","SAN MIGUEL","UNION AGUA BLANCA"]
[null,"061201","CAJAMARCA","SAN PABLO","SAN PABLO"]
[null,"061202","CAJAMARCA","SAN PABLO","SAN BERNARDINO"]
[null,"061203","CAJAMARCA","SAN PABLO","SAN LUIS"]
[null,"061204","CAJAMARCA","SAN PABLO","TUMBADEN"]
[null,"061301","CAJAMARCA","SANTA CRUZ","SANTA CRUZ"]
[null,"061302","CAJAMARCA","SANTA CRUZ","ANDABAMBA"]
[null,"061303","CAJAMARCA","SANTA CRUZ","CATACHE"]
[null,"061304","CAJAMARCA","SANTA CRUZ","CHANCAYBAÑOS"]
[null,"061305","CAJAMARCA","SANTA CRUZ","LA ESPERANZA"]
[null,"061306","CAJAMARCA","SANTA CRUZ","NINABAMBA"]
[null,"061307","CAJAMARCA","SANTA CRUZ","PULAN"]
[null,"061308","CAJAMARCA","SANTA CRUZ","SAUCEPAMPA"]
[null,"061309","CAJAMARCA","SANTA CRUZ","SEXI"]
[null,"061310","CAJAMARCA","SANTA CRUZ","UTICYACU"]
[null,"061311","CAJAMARCA","SANTA CRUZ","YAUYUCAN"]
[null,"070101","CALLAO","CALLAO","CALLAO"]
[null,"070102","CALLAO","CALLAO","BELLAVISTA"]
[null,"070103","CALLAO","CALLAO","CARMEN DE LA LEGUA REYNOSO"]
[null,"070104","CALLAO","CALLAO","LA PERLA"]
[null,"070105","CALLAO","CALLAO","LA PUNTA"]
[null,"070106","CALLAO","CALLAO","VENTANILLA"]
[null,"070107","CALLAO","CALLAO","MI PERU"]
[null,"080101","CUSCO","CUSCO","CUSCO"]
[null,"080102","CUSCO","CUSCO","CCORCA"]
[null,"080103","CUSCO","CUSCO","POROY"]
[null,"080104","CUSCO","CUSCO","SAN JERONIMO"]
[null,"080105","CUSCO","CUSCO","SAN SEBASTIAN"]
[null,"080106","CUSCO","CUSCO","SANTIAGO"]
[null,"080107","CUSCO","CUSCO","SAYLLA"]
[null,"080108","CUSCO","CUSCO","WANCHAQ"]
[null,"080201","CUSCO","ACOMAYO","ACOMAYO"]
[null,"080202","CUSCO","ACOMAYO","ACOPIA"]
[null,"080203","CUSCO","ACOMAYO","ACOS"]
[null,"080204","CUSCO","ACOMAYO","MOSOC LLACTA"]
[null,"080205","CUSCO","ACOMAYO","POMACANCHI"]
[null,"080206","CUSCO","ACOMAYO","RONDOCAN"]
[null,"080207","CUSCO","ACOMAYO","SANGARARA"]
[null,"080301","CUSCO","ANTA","ANTA"]
[null,"080302","CUSCO","ANTA","ANCAHUASI"]
[null,"080303","CUSCO","ANTA","CACHIMAYO"]
[null,"080304","CUSCO","ANTA","CHINCHAYPUJIO"]
[null,"080305","CUSCO","ANTA","HUAROCONDO"]
[null,"080306","CUSCO","ANTA","LIMATAMBO"]
[null,"080307","CUSCO","ANTA","MOLLEPATA"]
[null,"080308","CUSCO","ANTA","PUCYURA"]
[null,"080309","CUSCO","ANTA","ZURITE"]
[null,"080401","CUSCO","CALCA","CALCA"]
[null,"080402","CUSCO","CALCA","COYA"]
[null,"080403","CUSCO","CALCA","LAMAY"]
[null,"080404","CUSCO","CALCA","LARES"]
[null,"080405","CUSCO","CALCA","PISAC"]
[null,"080406","CUSCO","CALCA","SAN SALVADOR"]
[null,"080407","CUSCO","CALCA","TARAY"]
[null,"080408","CUSCO","CALCA","YANATILE"]
[null,"080501","CUSCO","CANAS","YANAOCA"]
[null,"080502","CUSCO","CANAS","CHECCA"]
[null,"080503","CUSCO","CANAS","KUNTURKANKI"]
[null,"080504","CUSCO","CANAS","LANGUI"]
[null,"080505","CUSCO","CANAS","LAYO"]
[null,"080506","CUSCO","CANAS","PAMPAMARCA"]
[null,"080507","CUSCO","CANAS","QUEHUE"]
[null,"080508","CUSCO","CANAS","TUPAC AMARU"]
[null,"080601","CUSCO","CANCHIS","SICUANI"]
[null,"080602","CUSCO","CANCHIS","CHECACUPE"]
[null,"080603","CUSCO","CANCHIS","COMBAPATA"]
[null,"080604","CUSCO","CANCHIS","MARANGANI"]
[null,"080605","CUSCO","CANCHIS","PITUMARCA"]
[null,"080606","CUSCO","CANCHIS","SAN PABLO"]
[null,"080607","CUSCO","CANCHIS","SAN PEDRO"]
[null,"080608","CUSCO","CANCHIS","TINTA"]
[null,"080701","CUSCO","CHUMBIVILCAS","SANTO TOMAS"]
[null,"080702","CUSCO","CHUMBIVILCAS","CAPACMARCA"]
[null,"080703","CUSCO","CHUMBIVILCAS","CHAMACA"]
[null,"080704","CUSCO","CHUMBIVILCAS","COLQUEMARCA"]
[null,"080705","CUSCO","CHUMBIVILCAS","LIVITACA"]
[null,"080706","CUSCO","CHUMBIVILCAS","LLUSCO"]
[null,"080707","CUSCO","CHUMBIVILCAS","QUIÑOTA"]
[null,"080708","CUSCO","CHUMBIVILCAS","VELILLE"]
[null,"080801","CUSCO","ESPINAR","ESPINAR"]
[null,"080802","CUSCO","ESPINAR","CONDOROMA"]
[null,"080803","CUSCO","ESPINAR","COPORAQUE"]
[null,"080804","CUSCO","ESPINAR","OCORURO"]
[null,"080805","CUSCO","ESPINAR","PALLPATA"]
[null,"080806","CUSCO","ESPINAR","PICHIGUA"]
[null,"080807","CUSCO","ESPINAR","SUYCKUTAMBO"]
[null,"080808","CUSCO","ESPINAR","ALTO PICHIGUA"]
[null,"080901","CUSCO","LA CONVENCION","SANTA ANA"]
[null,"080902","CUSCO","LA CONVENCION","ECHARATE"]
[null,"080903","CUSCO","LA CONVENCION","HUAYOPATA"]
[null,"080904","CUSCO","LA CONVENCION","MARANURA"]
[null,"080905","CUSCO","LA CONVENCION","OCOBAMBA"]
[null,"080906","CUSCO","LA CONVENCION","QUELLOUNO"]
[null,"080907","CUSCO","LA CONVENCION","KIMBIRI"]
[null,"080908","CUSCO","LA CONVENCION","SANTA TERESA"]
[null,"080909","CUSCO","LA CONVENCION","VILCABAMBA"]
[null,"080910","CUSCO","LA CONVENCION","PICHARI"]
[null,"080911","CUSCO","LA CONVENCION","INKAWASI"]
[null,"080912","CUSCO","LA CONVENCION","VILLA VIRGEN"]
[null,"080913","CUSCO","LA CONVENCION","VILLA KINTIARINA"]
[null,"080914","CUSCO","LA CONVENCION","MEGANTONI"]
[null,"080915","CUSCO","LA CONVENCION","KUMPIRUSHIATO"]
[null,"080916","CUSCO","LA CONVENCION","CIELO PUNCO"]
[null,"080917","CUSCO","LA CONVENCION","MANITEA"]
[null,"080918","CUSCO","LA CONVENCION","UNION ASHANINKA"]
[null,"081001","CUSCO","PARURO","PARURO"]
[null,"081002","CUSCO","PARURO","ACCHA"]
[null,"081003","CUSCO","PARURO","CCAPI"]
[null,"081004","CUSCO","PARURO","COLCHA"]
[null,"081005","CUSCO","PARURO","HUANOQUITE"]
[null,"081006","CUSCO","PARURO","OMACHA"]
[null,"081007","CUSCO","PARURO","PACCARITAMBO"]
[null,"081008","CUSCO","PARURO","PILLPINTO"]
[null,"081009","CUSCO","PARURO","YAURISQUE"]
[null,"081101","CUSCO","PAUCARTAMBO","PAUCARTAMBO"]
[null,"081102","CUSCO","PAUCARTAMBO","CAICAY"]
[null,"081103","CUSCO","PAUCARTAMBO","CHALLABAMBA"]
[null,"081104","CUSCO","PAUCARTAMBO","COLQUEPATA"]
[null,"081105","CUSCO","PAUCARTAMBO","HUANCARANI"]
[null,"081106","CUSCO","PAUCARTAMBO","KOSÑIPATA"]
[null,"081201","CUSCO","QUISPICANCHI","URCOS"]
[null,"081202","CUSCO","QUISPICANCHI","ANDAHUAYLILLAS"]
[null,"081203","CUSCO","QUISPICANCHI","CAMANTI"]
[null,"081204","CUSCO","QUISPICANCHI","CCARHUAYO"]
[null,"081205","CUSCO","QUISPICANCHI","CCATCA"]
[null,"081206","CUSCO","QUISPICANCHI","CUSIPATA"]
[null,"081207","CUSCO","QUISPICANCHI","HUARO"]
[null,"081208","CUSCO","QUISPICANCHI","LUCRE"]
[null,"081209","CUSCO","QUISPICANCHI","MARCAPATA"]
[null,"081210","CUSCO","QUISPICANCHI","OCONGATE"]
[null,"081211","CUSCO","QUISPICANCHI","OROPESA"]
[null,"081212","CUSCO","QUISPICANCHI","QUIQUIJANA"]
[null,"081301","CUSCO","URUBAMBA","URUBAMBA"]
[null,"081302","CUSCO","URUBAMBA","CHINCHERO"]
[null,"081303","CUSCO","URUBAMBA","HUAYLLABAMBA"]
[null,"081304","CUSCO","URUBAMBA","MACHUPICCHU"]
[null,"081305","CUSCO","URUBAMBA","MARAS"]
[null,"081306","CUSCO","URUBAMBA","OLLANTAYTAMBO"]
[null,"081307","CUSCO","URUBAMBA","YUCAY"]
[null,"090101","HUANCAVELICA","HUANCAVELICA","HUANCAVELICA"]
[null,"090102","HUANCAVELICA","HUANCAVELICA","ACOBAMBILLA"]
[null,"090103","HUANCAVELICA","HUANCAVELICA","ACORIA"]
[null,"090104","HUANCAVELICA","HUANCAVELICA","CONAYCA"]
[null,"090105","HUANCAVELICA","HUANCAVELICA","CUENCA"]
[null,"090106","HUANCAVELICA","HUANCAVELICA","HUACHOCOLPA"]
[null,"090107","HUANCAVELICA","HUANCAVELICA","HUAYLLAHUARA"]
[null,"090108","HUANCAVELICA","HUANCAVELICA","IZCUCHACA"]
[null,"090109","HUANCAVELICA","HUANCAVELICA","LARIA"]
[null,"090110","HUANCAVELICA","HUANCAVELICA","MANTA"]
[null,"090111","HUANCAVELICA","HUANCAVELICA","MARISCAL CACERES"]
[null,"090112","HUANCAVELICA","HUANCAVELICA","MOYA"]
[null,"090113","HUANCAVELICA","HUANCAVELICA","NUEVO OCCORO"]
[null,"090114","HUANCAVELICA","HUANCAVELICA","PALCA"]
[null,"090115","HUANCAVELICA","HUANCAVELICA","PILCHACA"]
[null,"090116","HUANCAVELICA","HUANCAVELICA","VILCA"]
[null,"090117","HUANCAVELICA","HUANCAVELICA","YAULI"]
[null,"090118","HUANCAVELICA","HUANCAVELICA","ASCENSION"]
[null,"090119","HUANCAVELICA","HUANCAVELICA","HUANDO"]
[null,"090201","HUANCAVELICA","ACOBAMBA","ACOBAMBA"]
[null,"090202","HUANCAVELICA","ACOBAMBA","ANDABAMBA"]
[null,"090203","HUANCAVELICA","ACOBAMBA","ANTA"]
[null,"090204","HUANCAVELICA","ACOBAMBA","CAJA"]
[null,"090205","HUANCAVELICA","ACOBAMBA","MARCAS"]
[null,"090206","HUANCAVELICA","ACOBAMBA","PAUCARA"]
[null,"090207","HUANCAVELICA","ACOBAMBA","POMACOCHA"]
[null,"090208","HUANCAVELICA","ACOBAMBA","ROSARIO"]
[null,"090301","HUANCAVELICA","ANGARAES","LIRCAY"]
[null,"090302","HUANCAVELICA","ANGARAES","ANCHONGA"]
[null,"090303","HUANCAVELICA","ANGARAES","CALLANMARCA"]
[null,"090304","HUANCAVELICA","ANGARAES","CCOCHACCASA"]
[null,"090305","HUANCAVELICA","ANGARAES","CHINCHO"]
[null,"090306","HUANCAVELICA","ANGARAES","CONGALLA"]
[null,"090307","HUANCAVELICA","ANGARAES","HUANCA-HUANCA"]
[null,"090308","HUANCAVELICA","ANGARAES","HUAYLLAY GRANDE"]
[null,"090309","HUANCAVELICA","ANGARAES","JULCAMARCA"]
[null,"090310","HUANCAVELICA","ANGARAES","SAN ANTONIO DE ANTAPARCO"]
[null,"090311","HUANCAVELICA","ANGARAES","SANTO TOMAS DE PATA"]
[null,"090312","HUANCAVELICA","ANGARAES","SECCLLA"]
[null,"090401","HUANCAVELICA","CASTROVIRREYNA","CASTROVIRREYNA"]
[null,"090402","HUANCAVELICA","CASTROVIRREYNA","ARMA"]
[null,"090403","HUANCAVELICA","CASTROVIRREYNA","AURAHUA"]
[null,"090404","HUANCAVELICA","CASTROVIRREYNA","CAPILLAS"]
[null,"090405","HUANCAVELICA","CASTROVIRREYNA","CHUPAMARCA"]
[null,"090406","HUANCAVELICA","CASTROVIRREYNA","COCAS"]
[null,"090407","HUANCAVELICA","CASTROVIRREYNA","HUACHOS"]
[null,"090408","HUANCAVELICA","CASTROVIRREYNA","HUAMATAMBO"]
[null,"090409","HUANCAVELICA","CASTROVIRREYNA","MOLLEPAMPA"]
[null,"090410","HUANCAVELICA","CASTROVIRREYNA","SAN JUAN"]
[null,"090411","HUANCAVELICA","CASTROVIRREYNA","SANTA ANA"]
[null,"090412","HUANCAVELICA","CASTROVIRREYNA","TANTARA"]
[null,"090413","HUANCAVELICA","CASTROVIRREYNA","TICRAPO"]
[null,"090501","HUANCAVELICA","CHURCAMPA","CHURCAMPA"]
[null,"090502","HUANCAVELICA","CHURCAMPA","ANCO"]
[null,"090503","HUANCAVELICA","CHURCAMPA","CHINCHIHUASI"]
[null,"090504","HUANCAVELICA","CHURCAMPA","EL CARMEN"]
[null,"090505","HUANCAVELICA","CHURCAMPA","LA MERCED"]
[null,"090506","HUANCAVELICA","CHURCAMPA","LOCROJA"]
[null,"090507","HUANCAVELICA","CHURCAMPA","PAUCARBAMBA"]
[null,"090508","HUANCAVELICA","CHURCAMPA","SAN MIGUEL DE MAYOCC"]
[null,"090509","HUANCAVELICA","CHURCAMPA","SAN PEDRO DE CORIS"]
[null,"090510","HUANCAVELICA","CHURCAMPA","PACHAMARCA"]
[null,"090511","HUANCAVELICA","CHURCAMPA","COSME"]
[null,"090601","HUANCAVELICA","HUAYTARA","HUAYTARA"]
[null,"090602","HUANCAVELICA","HUAYTARA","AYAVI"]
[null,"090603","HUANCAVELICA","HUAYTARA","CORDOVA"]
[null,"090604","HUANCAVELICA","HUAYTARA","HUAYACUNDO ARMA"]
[null,"090605","HUANCAVELICA","HUAYTARA","LARAMARCA"]
[null,"090606","HUANCAVELICA","HUAYTARA","OCOYO"]
[null,"090607","HUANCAVELICA","HUAYTARA","PILPICHACA"]
[null,"090608","HUANCAVELICA","HUAYTARA","QUERCO"]
[null,"090609","HUANCAVELICA","HUAYTARA","QUITO-ARMA"]
[null,"090610","HUANCAVELICA","HUAYTARA","SAN ANTONIO DE CUSICANCHA"]
[null,"090611","HUANCAVELICA","HUAYTARA","SAN FRANCISCO DE SANGAYAICO"]
[null,"090612","HUANCAVELICA","HUAYTARA","SAN ISIDRO"]
[null,"090613","HUANCAVELICA","HUAYTARA","SANTIAGO DE CHOCORVOS"]
[null,"090614","HUANCAVELICA","HUAYTARA","SANTIAGO DE QUIRAHUARA"]
[null,"090615","HUANCAVELICA","HUAYTARA","SANTO DOMINGO DE CAPILLAS"]
[null,"090616","HUANCAVELICA","HUAYTARA","TAMBO"]
[null,"090701","HUANCAVELICA","TAYACAJA","PAMPAS"]
[null,"090702","HUANCAVELICA","TAYACAJA","ACOSTAMBO"]
[null,"090703","HUANCAVELICA","TAYACAJA","ACRAQUIA"]
[null,"090704","HUANCAVELICA","TAYACAJA","AHUAYCHA"]
[null,"090705","HUANCAVELICA","TAYACAJA","COLCABAMBA"]
[null,"090706","HUANCAVELICA","TAYACAJA","DANIEL HERNANDEZ"]
[null,"090707","HUANCAVELICA","TAYACAJA","HUACHOCOLPA"]
[null,"090709","HUANCAVELICA","TAYACAJA","HUARIBAMBA"]
[null,"090710","HUANCAVELICA","TAYACAJA","ÑAHUIMPUQUIO"]
[null,"090711","HUANCAVELICA","TAYACAJA","PAZOS"]
[null,"090713","HUANCAVELICA","TAYACAJA","QUISHUAR"]
[null,"090714","HUANCAVELICA","TAYACAJA","SALCABAMBA"]
[null,"090715","HUANCAVELICA","TAYACAJA","SALCAHUASI"]
[null,"090716","HUANCAVELICA","TAYACAJA","SAN MARCOS DE ROCCHAC"]
[null,"090717","HUANCAVELICA","TAYACAJA","SURCUBAMBA"]
[null,"090718","HUANCAVELICA","TAYACAJA","TINTAY PUNCU"]
[null,"090719","HUANCAVELICA","TAYACAJA","QUICHUAS"]
[null,"090720","HUANCAVELICA","TAYACAJA","ANDAYMARCA"]
[null,"090721","HUANCAVELICA","TAYACAJA","ROBLE"]
[null,"090722","HUANCAVELICA","TAYACAJA","PICHOS"]
[null,"090723","HUANCAVELICA","TAYACAJA","SANTIAGO DE TUCUMA"]
[null,"090724","HUANCAVELICA","TAYACAJA","LAMBRAS"]
[null,"090725","HUANCAVELICA","TAYACAJA","COCHABAMBA"]
[null,"100101","HUANUCO","HUANUCO","HUANUCO"]
[null,"100102","HUANUCO","HUANUCO","AMARILIS"]
[null,"100103","HUANUCO","HUANUCO","CHINCHAO"]
[null,"100104","HUANUCO","HUANUCO","CHURUBAMBA"]
[null,"100105","HUANUCO","HUANUCO","MARGOS"]
[null,"100106","HUANUCO","HUANUCO","QUISQUI (KICHKI)"]
[null,"100107","HUANUCO","HUANUCO","SAN FRANCISCO DE CAYRAN"]
[null,"100108","HUANUCO","HUANUCO","SAN PEDRO DE CHAULAN"]
[null,"100109","HUANUCO","HUANUCO","SANTA MARIA DEL VALLE"]
[null,"100110","HUANUCO","HUANUCO","YARUMAYO"]
[null,"100111","HUANUCO","HUANUCO","PILLCO MARCA"]
[null,"100112","HUANUCO","HUANUCO","YACUS"]
[null,"100113","HUANUCO","HUANUCO","SAN PABLO DE PILLAO"]
[null,"100201","HUANUCO","AMBO","AMBO"]
[null,"100202","HUANUCO","AMBO","CAYNA"]
[null,"100203","HUANUCO","AMBO","COLPAS"]
[null,"100204","HUANUCO","AMBO","CONCHAMARCA"]
[null,"100205","HUANUCO","AMBO","HUACAR"]
[null,"100206","HUANUCO","AMBO","SAN FRANCISCO"]
[null,"100207","HUANUCO","AMBO","SAN RAFAEL"]
[null,"100208","HUANUCO","AMBO","TOMAY KICHWA"]
[null,"100301","HUANUCO","DOS DE MAYO","LA UNION"]
[null,"100307","HUANUCO","DOS DE MAYO","CHUQUIS"]
[null,"100311","HUANUCO","DOS DE MAYO","MARIAS"]
[null,"100313","HUANUCO","DOS DE MAYO","PACHAS"]
[null,"100316","HUANUCO","DOS DE MAYO","QUIVILLA"]
[null,"100317","HUANUCO","DOS DE MAYO","RIPAN"]
[null,"100321","HUANUCO","DOS DE MAYO","SHUNQUI"]
[null,"100322","HUANUCO","DOS DE MAYO","SILLAPATA"]
[null,"100323","HUANUCO","DOS DE MAYO","YANAS"]
[null,"100401","HUANUCO","HUACAYBAMBA","HUACAYBAMBA"]
[null,"100402","HUANUCO","HUACAYBAMBA","CANCHABAMBA"]
[null,"100403","HUANUCO","HUACAYBAMBA","COCHABAMBA"]
[null,"100404","HUANUCO","HUACAYBAMBA","PINRA"]
[null,"100501","HUANUCO","HUAMALIES","LLATA"]
[null,"100502","HUANUCO","HUAMALIES","ARANCAY"]
[null,"100503","HUANUCO","HUAMALIES","CHAVIN DE PARIARCA"]
[null,"100504","HUANUCO","HUAMALIES","JACAS GRANDE"]
[null,"100505","HUANUCO","HUAMALIES","JIRCAN"]
[null,"100506","HUANUCO","HUAMALIES","MIRAFLORES"]
[null,"100507","HUANUCO","HUAMALIES","MONZON"]
[null,"100508","HUANUCO","HUAMALIES","PUNCHAO"]
[null,"100509","HUANUCO","HUAMALIES","PUÑOS"]
[null,"100510","HUANUCO","HUAMALIES","SINGA"]
[null,"100511","HUANUCO","HUAMALIES","TANTAMAYO"]
[null,"100601","HUANUCO","LEONCIO PRADO","RUPA-RUPA"]
[null,"100602","HUANUCO","LEONCIO PRADO","DANIEL ALOMIA ROBLES"]
[null,"100603","HUANUCO","LEONCIO PRADO","HERMILIO VALDIZAN"]
[null,"100604","HUANUCO","LEONCIO PRADO","JOSE CRESPO Y CASTILLO"]
[null,"100605","HUANUCO","LEONCIO PRADO","LUYANDO"]
[null,"100606","HUANUCO","LEONCIO PRADO","MARIANO DAMASO BERAUN"]
[null,"100607","HUANUCO","LEONCIO PRADO","PUCAYACU"]
[null,"100608","HUANUCO","LEONCIO PRADO","CASTILLO GRANDE"]
[null,"100609","HUANUCO","LEONCIO PRADO","PUEBLO NUEVO"]
[null,"100610","HUANUCO","LEONCIO PRADO","SANTO DOMINGO DE ANDA"]
[null,"100701","HUANUCO","MARAÑON","HUACRACHUCO"]
[null,"100702","HUANUCO","MARAÑON","CHOLON"]
[null,"100703","HUANUCO","MARAÑON","SAN BUENAVENTURA"]
[null,"100704","HUANUCO","MARAÑON","LA MORADA"]
[null,"100705","HUANUCO","MARAÑON","SANTA ROSA DE ALTO YANAJANCA"]
[null,"100801","HUANUCO","PACHITEA","PANAO"]
[null,"100802","HUANUCO","PACHITEA","CHAGLLA"]
[null,"100803","HUANUCO","PACHITEA","MOLINO"]
[null,"100804","HUANUCO","PACHITEA","UMARI"]
[null,"100901","HUANUCO","PUERTO INCA","PUERTO INCA"]
[null,"100902","HUANUCO","PUERTO INCA","CODO DEL POZUZO"]
[null,"100903","HUANUCO","PUERTO INCA","HONORIA"]
[null,"100904","HUANUCO","PUERTO INCA","TOURNAVISTA"]
[null,"100905","HUANUCO","PUERTO INCA","YUYAPICHIS"]
[null,"101001","HUANUCO","LAURICOCHA","JESUS"]
[null,"101002","HUANUCO","LAURICOCHA","BAÑOS"]
[null,"101003","HUANUCO","LAURICOCHA","JIVIA"]
[null,"101004","HUANUCO","LAURICOCHA","QUEROPALCA"]
[null,"101005","HUANUCO","LAURICOCHA","RONDOS"]
[null,"101006","HUANUCO","LAURICOCHA","SAN FRANCISCO DE ASIS"]
[null,"101007","HUANUCO","LAURICOCHA","SAN MIGUEL DE CAURI"]
[null,"101101","HUANUCO","YAROWILCA","CHAVINILLO"]
[null,"101102","HUANUCO","YAROWILCA","CAHUAC"]
[null,"101103","HUANUCO","YAROWILCA","CHACABAMBA"]
[null,"101104","HUANUCO","YAROWILCA","APARICIO POMARES"]
[null,"101105","HUANUCO","YAROWILCA","JACAS CHICO"]
[null,"101106","HUANUCO","YAROWILCA","OBAS"]
[null,"101107","HUANUCO","YAROWILCA","PAMPAMARCA"]
[null,"101108","HUANUCO","YAROWILCA","CHORAS"]
[null,"110101","ICA","ICA","ICA"]
[null,"110102","ICA","ICA","LA TINGUIÑA"]
[null,"110103","ICA","ICA","LOS AQUIJES"]
[null,"110104","ICA","ICA","OCUCAJE"]
[null,"110105","ICA","ICA","PACHACUTEC"]
[null,"110106","ICA","ICA","PARCONA"]
[null,"110107","ICA","ICA","PUEBLO NUEVO"]
[null,"110108","ICA","ICA","SALAS"]
[null,"110109","ICA","ICA","SAN JOSE DE LOS MOLINOS"]
[null,"110110","ICA","ICA","SAN JUAN BAUTISTA"]
[null,"110111","ICA","ICA","SANTIAGO"]
[null,"110112","ICA","ICA","SUBTANJALLA"]
[null,"110113","ICA","ICA","TATE"]
[null,"110114","ICA","ICA","YAUCA DEL ROSARIO"]
[null,"110201","ICA","CHINCHA","CHINCHA ALTA"]
[null,"110202","ICA","CHINCHA","ALTO LARAN"]
[null,"110203","ICA","CHINCHA","CHAVIN"]
[null,"110204","ICA","CHINCHA","CHINCHA BAJA"]
[null,"110205","ICA","CHINCHA","EL CARMEN"]
[null,"110206","ICA","CHINCHA","GROCIO PRADO"]
[null,"110207","ICA","CHINCHA","PUEBLO NUEVO"]
[null,"110208","ICA","CHINCHA","SAN JUAN DE YANAC"]
[null,"110209","ICA","CHINCHA","SAN PEDRO DE HUACARPANA"]
[null,"110210","ICA","CHINCHA","SUNAMPE"]
[null,"110211","ICA","CHINCHA","TAMBO DE MORA"]
[null,"110301","ICA","NASCA","NASCA"]
[null,"110302","ICA","NASCA","CHANGUILLO"]
[null,"110303","ICA","NASCA","EL INGENIO"]
[null,"110304","ICA","NASCA","MARCONA"]
[null,"110305","ICA","NASCA","VISTA ALEGRE"]
[null,"110401","ICA","PALPA","PALPA"]
[null,"110402","ICA","PALPA","LLIPATA"]
[null,"110403","ICA","PALPA","RIO GRANDE"]
[null,"110404","ICA","PALPA","SANTA CRUZ"]
[null,"110405","ICA","PALPA","TIBILLO"]
[null,"110501","ICA","PISCO","PISCO"]
[null,"110502","ICA","PISCO","HUANCANO"]
[null,"110503","ICA","PISCO","HUMAY"]
[null,"110504","ICA","PISCO","INDEPENDENCIA"]
[null,"110505","ICA","PISCO","PARACAS"]
[null,"110506","ICA","PISCO","SAN ANDRES"]
[null,"110507","ICA","PISCO","SAN CLEMENTE"]
[null,"110508","ICA","PISCO","TUPAC AMARU INCA"]
[null,"120101","JUNIN","HUANCAYO","HUANCAYO"]
[null,"120104","JUNIN","HUANCAYO","CARHUACALLANGA"]
[null,"120105","JUNIN","HUANCAYO","CHACAPAMPA"]
[null,"120106","JUNIN","HUANCAYO","CHICCHE"]
[null,"120107","JUNIN","HUANCAYO","CHILCA"]
[null,"120108","JUNIN","HUANCAYO","CHONGOS ALTO"]
[null,"120111","JUNIN","HUANCAYO","CHUPURO"]
[null,"120112","JUNIN","HUANCAYO","COLCA"]
[null,"120113","JUNIN","HUANCAYO","CULLHUAS"]
[null,"120114","JUNIN","HUANCAYO","EL TAMBO"]
[null,"120116","JUNIN","HUANCAYO","HUACRAPUQUIO"]
[null,"120117","JUNIN","HUANCAYO","HUALHUAS"]
[null,"120119","JUNIN","HUANCAYO","HUANCAN"]
[null,"120120","JUNIN","HUANCAYO","HUASICANCHA"]
[null,"120121","JUNIN","HUANCAYO","HUAYUCACHI"]
[null,"120122","JUNIN","HUANCAYO","INGENIO"]
[null,"120124","JUNIN","HUANCAYO","PARIAHUANCA"]
[null,"120125","JUNIN","HUANCAYO","PILCOMAYO"]
[null,"120126","JUNIN","HUANCAYO","PUCARA"]
[null,"120127","JUNIN","HUANCAYO","QUICHUAY"]
[null,"120128","JUNIN","HUANCAYO","QUILCAS"]
[null,"120129","JUNIN","HUANCAYO","SAN AGUSTIN"]
[null,"120130","JUNIN","HUANCAYO","SAN JERONIMO DE TUNAN"]
[null,"120132","JUNIN","HUANCAYO","SAÑO"]
[null,"120133","JUNIN","HUANCAYO","SAPALLANGA"]
[null,"120134","JUNIN","HUANCAYO","SICAYA"]
[null,"120135","JUNIN","HUANCAYO","SANTO DOMINGO DE ACOBAMBA"]
[null,"120136","JUNIN","HUANCAYO","VIQUES"]
[null,"120201","JUNIN","CONCEPCION","CONCEPCION"]
[null,"120202","JUNIN","CONCEPCION","ACO"]
[null,"120203","JUNIN","CONCEPCION","ANDAMARCA"]
[null,"120204","JUNIN","CONCEPCION","CHAMBARA"]
[null,"120205","JUNIN","CONCEPCION","COCHAS"]
[null,"120206","JUNIN","CONCEPCION","COMAS"]
[null,"120207","JUNIN","CONCEPCION","HEROINAS TOLEDO"]
[null,"120208","JUNIN","CONCEPCION","MANZANARES"]
[null,"120209","JUNIN","CONCEPCION","MARISCAL CASTILLA"]
[null,"120210","JUNIN","CONCEPCION","MATAHUASI"]
[null,"120211","JUNIN","CONCEPCION","MITO"]
[null,"120212","JUNIN","CONCEPCION","NUEVE DE JULIO"]
[null,"120213","JUNIN","CONCEPCION","ORCOTUNA"]
[null,"120214","JUNIN","CONCEPCION","SAN JOSE DE QUERO"]
[null,"120215","JUNIN","CONCEPCION","SANTA ROSA DE OCOPA"]
[null,"120301","JUNIN","CHANCHAMAYO","CHANCHAMAYO"]
[null,"120302","JUNIN","CHANCHAMAYO","PERENE"]
[null,"120303","JUNIN","CHANCHAMAYO","PICHANAQUI"]
[null,"120304","JUNIN","CHANCHAMAYO","SAN LUIS DE SHUARO"]
[null,"120305","JUNIN","CHANCHAMAYO","SAN RAMON"]
[null,"120306","JUNIN","CHANCHAMAYO","VITOC"]
[null,"120401","JUNIN","JAUJA","JAUJA"]
[null,"120402","JUNIN","JAUJA","ACOLLA"]
[null,"120403","JUNIN","JAUJA","APATA"]
[null,"120404","JUNIN","JAUJA","ATAURA"]
[null,"120405","JUNIN","JAUJA","CANCHAYLLO"]
[null,"120406","JUNIN","JAUJA","CURICACA"]
[null,"120407","JUNIN","JAUJA","EL MANTARO"]
[null,"120408","JUNIN","JAUJA","HUAMALI"]
[null,"120409","JUNIN","JAUJA","HUARIPAMPA"]
[null,"120410","JUNIN","JAUJA","HUERTAS"]
[null,"120411","JUNIN","JAUJA","JANJAILLO"]
[null,"120412","JUNIN","JAUJA","JULCAN"]
[null,"120413","JUNIN","JAUJA","LEONOR ORDOÑEZ"]
[null,"120414","JUNIN","JAUJA","LLOCLLAPAMPA"]
[null,"120415","JUNIN","JAUJA","MARCO"]
[null,"120416","JUNIN","JAUJA","MASMA"]
[null,"120417","JUNIN","JAUJA","MASMA CHICCHE"]
[null,"120418","JUNIN","JAUJA","MOLINOS"]
[null,"120419","JUNIN","JAUJA","MONOBAMBA"]
[null,"120420","JUNIN","JAUJA","MUQUI"]
[null,"120421","JUNIN","JAUJA","MUQUIYAUYO"]
[null,"120422","JUNIN","JAUJA","PACA"]
[null,"120423","JUNIN","JAUJA","PACCHA"]
[null,"120424","JUNIN","JAUJA","PANCAN"]
[null,"120425","JUNIN","JAUJA","PARCO"]
[null,"120426","JUNIN","JAUJA","POMACANCHA"]
[null,"120427","JUNIN","JAUJA","RICRAN"]
[null,"120428","JUNIN","JAUJA","SAN LORENZO"]
[null,"120429","JUNIN","JAUJA","SAN PEDRO DE CHUNAN"]
[null,"120430","JUNIN","JAUJA","SAUSA"]
[null,"120431","JUNIN","JAUJA","SINCOS"]
[null,"120432","JUNIN","JAUJA","TUNAN MARCA"]
[null,"120433","JUNIN","JAUJA","YAULI"]
[null,"120434","JUNIN","JAUJA","YAUYOS"]
[null,"120501","JUNIN","JUNIN","JUNIN"]
[null,"120502","JUNIN","JUNIN","CARHUAMAYO"]
[null,"120503","JUNIN","JUNIN","ONDORES"]
[null,"120504","JUNIN","JUNIN","ULCUMAYO"]
[null,"120601","JUNIN","SATIPO","SATIPO"]
[null,"120602","JUNIN","SATIPO","COVIRIALI"]
[null,"120603","JUNIN","SATIPO","LLAYLLA"]
[null,"120604","JUNIN","SATIPO","MAZAMARI"]
[null,"120605","JUNIN","SATIPO","PAMPA HERMOSA"]
[null,"120606","JUNIN","SATIPO","PANGOA"]
[null,"120607","JUNIN","SATIPO","RIO NEGRO"]
[null,"120608","JUNIN","SATIPO","RIO TAMBO"]
[null,"120609","JUNIN","SATIPO","VIZCATAN DEL ENE"]
[null,"120701","JUNIN","TARMA","TARMA"]
[null,"120702","JUNIN","TARMA","ACOBAMBA"]
[null,"120703","JUNIN","TARMA","HUARICOLCA"]
[null,"120704","JUNIN","TARMA","HUASAHUASI"]
[null,"120705","JUNIN","TARMA","LA UNION"]
[null,"120706","JUNIN","TARMA","PALCA"]
[null,"120707","JUNIN","TARMA","PALCAMAYO"]
[null,"120708","JUNIN","TARMA","SAN PEDRO DE CAJAS"]
[null,"120709","JUNIN","TARMA","TAPO"]
[null,"120801","JUNIN","YAULI","LA OROYA"]
[null,"120802","JUNIN","YAULI","CHACAPALPA"]
[null,"120803","JUNIN","YAULI","HUAY-HUAY"]
[null,"120804","JUNIN","YAULI","MARCAPOMACOCHA"]
[null,"120805","JUNIN","YAULI","MOROCOCHA"]
[null,"120806","JUNIN","YAULI","PACCHA"]
[null,"120807","JUNIN","YAULI","SANTA BARBARA DE CARHUACAYAN"]
[null,"120808","JUNIN","YAULI","SANTA ROSA DE SACCO"]
[null,"120809","JUNIN","YAULI","SUITUCANCHA"]
[null,"120810","JUNIN","YAULI","YAULI"]
[null,"120901","JUNIN","CHUPACA","CHUPACA"]
[null,"120902","JUNIN","CHUPACA","AHUAC"]
[null,"120903","JUNIN","CHUPACA","CHONGOS BAJO"]
[null,"120904","JUNIN","CHUPACA","HUACHAC"]
[null,"120905","JUNIN","CHUPACA","HUAMANCACA CHICO"]
[null,"120906","JUNIN","CHUPACA","SAN JUAN DE ISCOS"]
[null,"120907","JUNIN","CHUPACA","SAN JUAN DE JARPA"]
[null,"120908","JUNIN","CHUPACA","TRES DE DICIEMBRE"]
[null,"120909","JUNIN","CHUPACA","YANACANCHA"]
[null,"130101","LA LIBERTAD","TRUJILLO","TRUJILLO"]
[null,"130102","LA LIBERTAD","TRUJILLO","EL PORVENIR"]
[null,"130103","LA LIBERTAD","TRUJILLO","FLORENCIA DE MORA"]
[null,"130104","LA LIBERTAD","TRUJILLO","HUANCHACO"]
[null,"130105","LA LIBERTAD","TRUJILLO","LA ESPERANZA"]
[null,"130106","LA LIBERTAD","TRUJILLO","LAREDO"]
[null,"130107","LA LIBERTAD","TRUJILLO","MOCHE"]
[null,"130108","LA LIBERTAD","TRUJILLO","POROTO"]
[null,"130109","LA LIBERTAD","TRUJILLO","SALAVERRY"]
[null,"130110","LA LIBERTAD","TRUJILLO","SIMBAL"]
[null,"130111","LA LIBERTAD","TRUJILLO","VICTOR LARCO HERRERA"]
[null,"130112","LA LIBERTAD","TRUJILLO","ALTO TRUJILLO"]
[null,"130201","LA LIBERTAD","ASCOPE","ASCOPE"]
[null,"130202","LA LIBERTAD","ASCOPE","CHICAMA"]
[null,"130203","LA LIBERTAD","ASCOPE","CHOCOPE"]
[null,"130204","LA LIBERTAD","ASCOPE","MAGDALENA DE CAO"]
[null,"130205","LA LIBERTAD","ASCOPE","PAIJAN"]
[null,"130206","LA LIBERTAD","ASCOPE","RAZURI"]
[null,"130207","LA LIBERTAD","ASCOPE","SANTIAGO DE CAO"]
[null,"130208","LA LIBERTAD","ASCOPE","CASA GRANDE"]
[null,"130301","LA LIBERTAD","BOLIVAR","BOLIVAR"]
[null,"130302","LA LIBERTAD","BOLIVAR","BAMBAMARCA"]
[null,"130303","LA LIBERTAD","BOLIVAR","CONDORMARCA"]
[null,"130304","LA LIBERTAD","BOLIVAR","LONGOTEA"]
[null,"130305","LA LIBERTAD","BOLIVAR","UCHUMARCA"]
[null,"130306","LA LIBERTAD","BOLIVAR","UCUNCHA"]
[null,"130401","LA LIBERTAD","CHEPEN","CHEPEN"]
[null,"130402","LA LIBERTAD","CHEPEN","PACANGA"]
[null,"130403","LA LIBERTAD","CHEPEN","PUEBLO NUEVO"]
[null,"130501","LA LIBERTAD","JULCAN","JULCAN"]
[null,"130502","LA LIBERTAD","JULCAN","CALAMARCA"]
[null,"130503","LA LIBERTAD","JULCAN","CARABAMBA"]
[null,"130504","LA LIBERTAD","JULCAN","HUASO"]
[null,"130601","LA LIBERTAD","OTUZCO","OTUZCO"]
[null,"130602","LA LIBERTAD","OTUZCO","AGALLPAMPA"]
[null,"130604","LA LIBERTAD","OTUZCO","CHARAT"]
[null,"130605","LA LIBERTAD","OTUZCO","HUARANCHAL"]
[null,"130606","LA LIBERTAD","OTUZCO","LA CUESTA"]
[null,"130608","LA LIBERTAD","OTUZCO","MACHE"]
[null,"130610","LA LIBERTAD","OTUZCO","PARANDAY"]
[null,"130611","LA LIBERTAD","OTUZCO","SALPO"]
[null,"130613","LA LIBERTAD","OTUZCO","SINSICAP"]
[null,"130614","LA LIBERTAD","OTUZCO","USQUIL"]
[null,"130701","LA LIBERTAD","PACASMAYO","SAN PEDRO DE LLOC"]
[null,"130702","LA LIBERTAD","PACASMAYO","GUADALUPE"]
[null,"130703","LA LIBERTAD","PACASMAYO","JEQUETEPEQUE"]
[null,"130704","LA LIBERTAD","PACASMAYO","PACASMAYO"]
[null,"130705","LA LIBERTAD","PACASMAYO","SAN JOSE"]
[null,"130801","LA LIBERTAD","PATAZ","TAYABAMBA"]
[null,"130802","LA LIBERTAD","PATAZ","BULDIBUYO"]
[null,"130803","LA LIBERTAD","PATAZ","CHILLIA"]
[null,"130804","LA LIBERTAD","PATAZ","HUANCASPATA"]
[null,"130805","LA LIBERTAD","PATAZ","HUAYLILLAS"]
[null,"130806","LA LIBERTAD","PATAZ","HUAYO"]
[null,"130807","LA LIBERTAD","PATAZ","ONGON"]
[null,"130808","LA LIBERTAD","PATAZ","PARCOY"]
[null,"130809","LA LIBERTAD","PATAZ","PATAZ"]
[null,"130810","LA LIBERTAD","PATAZ","PIAS"]
[null,"130811","LA LIBERTAD","PATAZ","SANTIAGO DE CHALLAS"]
[null,"130812","LA LIBERTAD","PATAZ","TAURIJA"]
[null,"130813","LA LIBERTAD","PATAZ","URPAY"]
[null,"130901","LA LIBERTAD","SANCHEZ CARRION","HUAMACHUCO"]
[null,"130902","LA LIBERTAD","SANCHEZ CARRION","CHUGAY"]
[null,"130903","LA LIBERTAD","SANCHEZ CARRION","COCHORCO"]
[null,"130904","LA LIBERTAD","SANCHEZ CARRION","CURGOS"]
[null,"130905","LA LIBERTAD","SANCHEZ CARRION","MARCABAL"]
[null,"130906","LA LIBERTAD","SANCHEZ CARRION","SANAGORAN"]
[null,"130907","LA LIBERTAD","SANCHEZ CARRION","SARIN"]
[null,"130908","LA LIBERTAD","SANCHEZ CARRION","SARTIMBAMBA"]
[null,"131001","LA LIBERTAD","SANTIAGO DE CHUCO","SANTIAGO DE CHUCO"]
[null,"131002","LA LIBERTAD","SANTIAGO DE CHUCO","ANGASMARCA"]
[null,"131003","LA LIBERTAD","SANTIAGO DE CHUCO","CACHICADAN"]
[null,"131004","LA LIBERTAD","SANTIAGO DE CHUCO","MOLLEBAMBA"]
[null,"131005","LA LIBERTAD","SANTIAGO DE CHUCO","MOLLEPATA"]
[null,"131006","LA LIBERTAD","SANTIAGO DE CHUCO","QUIRUVILCA"]
[null,"131007","LA LIBERTAD","SANTIAGO DE CHUCO","SANTA CRUZ DE CHUCA"]
[null,"131008","LA LIBERTAD","SANTIAGO DE CHUCO","SITABAMBA"]
[null,"131101","LA LIBERTAD","GRAN CHIMU","CASCAS"]
[null,"131102","LA LIBERTAD","GRAN CHIMU","LUCMA"]
[null,"131103","LA LIBERTAD","GRAN CHIMU","MARMOT"]
[null,"131104","LA LIBERTAD","GRAN CHIMU","SAYAPULLO"]
[null,"131201","LA LIBERTAD","VIRU","VIRU"]
[null,"131202","LA LIBERTAD","VIRU","CHAO"]
[null,"131203","LA LIBERTAD","VIRU","GUADALUPITO"]
[null,"140101","LAMBAYEQUE","CHICLAYO","CHICLAYO"]
[null,"140102","LAMBAYEQUE","CHICLAYO","CHONGOYAPE"]
[null,"140103","LAMBAYEQUE","CHICLAYO","ETEN"]
[null,"140104","LAMBAYEQUE","CHICLAYO","ETEN PUERTO"]
[null,"140105","LAMBAYEQUE","CHICLAYO","JOSE LEONARDO ORTIZ"]
[null,"140106","LAMBAYEQUE","CHICLAYO","LA VICTORIA"]
[null,"140107","LAMBAYEQUE","CHICLAYO","LAGUNAS"]
[null,"140108","LAMBAYEQUE","CHICLAYO","MONSEFU"]
[null,"140109","LAMBAYEQUE","CHICLAYO","NUEVA ARICA"]
[null,"140110","LAMBAYEQUE","CHICLAYO","OYOTUN"]
[null,"140111","LAMBAYEQUE","CHICLAYO","PICSI"]
[null,"140112","LAMBAYEQUE","CHICLAYO","PIMENTEL"]
[null,"140113","LAMBAYEQUE","CHICLAYO","REQUE"]
[null,"140114","LAMBAYEQUE","CHICLAYO","SANTA ROSA"]
[null,"140115","LAMBAYEQUE","CHICLAYO","SAÑA"]
[null,"140116","LAMBAYEQUE","CHICLAYO","CAYALTI"]
[null,"140117","LAMBAYEQUE","CHICLAYO","PATAPO"]
[null,"140118","LAMBAYEQUE","CHICLAYO","POMALCA"]
[null,"140119","LAMBAYEQUE","CHICLAYO","PUCALA"]
[null,"140120","LAMBAYEQUE","CHICLAYO","TUMAN"]
[null,"140201","LAMBAYEQUE","FERREÑAFE","FERREÑAFE"]
[null,"140202","LAMBAYEQUE","FERREÑAFE","CAÑARIS"]
[null,"140203","LAMBAYEQUE","FERREÑAFE","INCAHUASI"]
[null,"140204","LAMBAYEQUE","FERREÑAFE","MANUEL ANTONIO MESONES MURO"]
[null,"140205","LAMBAYEQUE","FERREÑAFE","PITIPO"]
[null,"140206","LAMBAYEQUE","FERREÑAFE","PUEBLO NUEVO"]
[null,"140301","LAMBAYEQUE","LAMBAYEQUE","LAMBAYEQUE"]
[null,"140302","LAMBAYEQUE","LAMBAYEQUE","CHOCHOPE"]
[null,"140303","LAMBAYEQUE","LAMBAYEQUE","ILLIMO"]
[null,"140304","LAMBAYEQUE","LAMBAYEQUE","JAYANCA"]
[null,"140305","LAMBAYEQUE","LAMBAYEQUE","MOCHUMI"]
[null,"140306","LAMBAYEQUE","LAMBAYEQUE","MORROPE"]
[null,"140307","LAMBAYEQUE","LAMBAYEQUE","MOTUPE"]
[null,"140308","LAMBAYEQUE","LAMBAYEQUE","OLMOS"]
[null,"140309","LAMBAYEQUE","LAMBAYEQUE","PACORA"]
[null,"140310","LAMBAYEQUE","LAMBAYEQUE","SALAS"]
[null,"140311","LAMBAYEQUE","LAMBAYEQUE","SAN JOSE"]
[null,"140312","LAMBAYEQUE","LAMBAYEQUE","TUCUME"]
[null,"150101","LIMA","LIMA","LIMA"]
[null,"150102","LIMA","LIMA","ANCON"]
[null,"150103","LIMA","LIMA","ATE"]
[null,"150104","LIMA","LIMA","BARRANCO"]
[null,"150105","LIMA","LIMA","BREÑA"]
[null,"150106","LIMA","LIMA","CARABAYLLO"]
[null,"150107","LIMA","LIMA","CHACLACAYO"]
[null,"150108","LIMA","LIMA","CHORRILLOS"]
[null,"150109","LIMA","LIMA","CIENEGUILLA"]
[null,"150110","LIMA","LIMA","COMAS"]
[null,"150111","LIMA","LIMA","EL AGUSTINO"]
[null,"150112","LIMA","LIMA","INDEPENDENCIA"]
[null,"150113","LIMA","LIMA","JESUS MARIA"]
[null,"150114","LIMA","LIMA","LA MOLINA"]
[null,"150115","LIMA","LIMA","LA VICTORIA"]
[null,"150116","LIMA","LIMA","LINCE"]
[null,"150117","LIMA","LIMA","LOS OLIVOS"]
[null,"150118","LIMA","LIMA","LURIGANCHO"]
[null,"150119","LIMA","LIMA","LURIN"]
[null,"150120","LIMA","LIMA","MAGDALENA DEL MAR"]
[null,"150121","LIMA","LIMA","PUEBLO LIBRE"]
[null,"150122","LIMA","LIMA","MIRAFLORES"]
[null,"150123","LIMA","LIMA","PACHACAMAC"]
[null,"150124","LIMA","LIMA","PUCUSANA"]
[null,"150125","LIMA","LIMA","PUENTE PIEDRA"]
[null,"150126","LIMA","LIMA","PUNTA HERMOSA"]
[null,"150127","LIMA","LIMA","PUNTA NEGRA"]
[null,"150128","LIMA","LIMA","RIMAC"]
[null,"150129","LIMA","LIMA","SAN BARTOLO"]
[null,"150130","LIMA","LIMA","SAN BORJA"]
[null,"150131","LIMA","LIMA","SAN ISIDRO"]
[null,"150132","LIMA","LIMA","SAN JUAN DE LURIGANCHO"]
[null,"150133","LIMA","LIMA","SAN JUAN DE MIRAFLORES"]
[null,"150134","LIMA","LIMA","SAN LUIS"]
[null,"150135","LIMA","LIMA","SAN MARTIN DE PORRES"]
[null,"150136","LIMA","LIMA","SAN MIGUEL"]
[null,"150137","LIMA","LIMA","SANTA ANITA"]
[null,"150138","LIMA","LIMA","SANTA MARIA DEL MAR"]
[null,"150139","LIMA","LIMA","SANTA ROSA"]
[null,"150140","LIMA","LIMA","SANTIAGO DE SURCO"]
[null,"150141","LIMA","LIMA","SURQUILLO"]
[null,"150142","LIMA","LIMA","VILLA EL SALVADOR"]
[null,"150143","LIMA","LIMA","VILLA MARIA DEL TRIUNFO"]
[null,"150201","LIMA","BARRANCA","BARRANCA"]
[null,"150202","LIMA","BARRANCA","PARAMONGA"]
[null,"150203","LIMA","BARRANCA","PATIVILCA"]
[null,"150204","LIMA","BARRANCA","SUPE"]
[null,"150205","LIMA","BARRANCA","SUPE PUERTO"]
[null,"150301","LIMA","CAJATAMBO","CAJATAMBO"]
[null,"150302","LIMA","CAJATAMBO","COPA"]
[null,"150303","LIMA","CAJATAMBO","GORGOR"]
[null,"150304","LIMA","CAJATAMBO","HUANCAPON"]
[null,"150305","LIMA","CAJATAMBO","MANAS"]
[null,"150401","LIMA","CANTA","CANTA"]
[null,"150402","LIMA","CANTA","ARAHUAY"]
[null,"150403","LIMA","CANTA","HUAMANTANGA"]
[null,"150404","LIMA","CANTA","HUAROS"]
[null,"150405","LIMA","CANTA","LACHAQUI"]
[null,"150406","LIMA","CANTA","SAN BUENAVENTURA"]
[null,"150407","LIMA","CANTA","SANTA ROSA DE QUIVES"]
[null,"150501","LIMA","CAÑETE","SAN VICENTE DE CAÑETE"]
[null,"150502","LIMA","CAÑETE","ASIA"]
[null,"150503","LIMA","CAÑETE","CALANGO"]
[null,"150504","LIMA","CAÑETE","CERRO AZUL"]
[null,"150505","LIMA","CAÑETE","CHILCA"]
[null,"150506","LIMA","CAÑETE","COAYLLO"]
[null,"150507","LIMA","CAÑETE","IMPERIAL"]
[null,"150508","LIMA","CAÑETE","LUNAHUANA"]
[null,"150509","LIMA","CAÑETE","MALA"]
[null,"150510","LIMA","CAÑETE","NUEVO IMPERIAL"]
[null,"150511","LIMA","CAÑETE","PACARAN"]
[null,"150512","LIMA","CAÑETE","QUILMANA"]
[null,"150513","LIMA","CAÑETE","SAN ANTONIO"]
[null,"150514","LIMA","CAÑETE","SAN LUIS"]
[null,"150515","LIMA","CAÑETE","SANTA CRUZ DE FLORES"]
[null,"150516","LIMA","CAÑETE","ZUÑIGA"]
[null,"150601","LIMA","HUARAL","HUARAL"]
[null,"150602","LIMA","HUARAL","ATAVILLOS ALTO"]
[null,"150603","LIMA","HUARAL","ATAVILLOS BAJO"]
[null,"150604","LIMA","HUARAL","AUCALLAMA"]
[null,"150605","LIMA","HUARAL","CHANCAY"]
[null,"150606","LIMA","HUARAL","IHUARI"]
[null,"150607","LIMA","HUARAL","LAMPIAN"]
[null,"150608","LIMA","HUARAL","PACARAOS"]
[null,"150609","LIMA","HUARAL","SAN MIGUEL DE ACOS"]
[null,"150610","LIMA","HUARAL","SANTA CRUZ DE ANDAMARCA"]
[null,"150611","LIMA","HUARAL","SUMBILCA"]
[null,"150612","LIMA","HUARAL","VEINTISIETE DE NOVIEMBRE"]
[null,"150701","LIMA","HUAROCHIRI","MATUCANA"]
[null,"150702","LIMA","HUAROCHIRI","ANTIOQUIA"]
[null,"150703","LIMA","HUAROCHIRI","CALLAHUANCA"]
[null,"150704","LIMA","HUAROCHIRI","CARAMPOMA"]
[null,"150705","LIMA","HUAROCHIRI","CHICLA"]
[null,"150706","LIMA","HUAROCHIRI","CUENCA"]
[null,"150707","LIMA","HUAROCHIRI","HUACHUPAMPA"]
[null,"150708","LIMA","HUAROCHIRI","HUANZA"]
[null,"150709","LIMA","HUAROCHIRI","HUAROCHIRI"]
[null,"150710","LIMA","HUAROCHIRI","LAHUAYTAMBO"]
[null,"150711","LIMA","HUAROCHIRI","LANGA"]
[null,"150712","LIMA","HUAROCHIRI","SAN PEDRO DE LARAOS"]
[null,"150713","LIMA","HUAROCHIRI","MARIATANA"]
[null,"150714","LIMA","HUAROCHIRI","RICARDO PALMA"]
[null,"150715","LIMA","HUAROCHIRI","SAN ANDRES DE TUPICOCHA"]
[null,"150716","LIMA","HUAROCHIRI","SAN ANTONIO"]
[null,"150717","LIMA","HUAROCHIRI","SAN BARTOLOME"]
[null,"150718","LIMA","HUAROCHIRI","SAN DAMIAN"]
[null,"150719","LIMA","HUAROCHIRI","SAN JUAN DE IRIS"]
[null,"150720","LIMA","HUAROCHIRI","SAN JUAN DE TANTARANCHE"]
[null,"150721","LIMA","HUAROCHIRI","SAN LORENZO DE QUINTI"]
[null,"150722","LIMA","HUAROCHIRI","SAN MATEO"]
[null,"150723","LIMA","HUAROCHIRI","SAN MATEO DE OTAO"]
[null,"150724","LIMA","HUAROCHIRI","SAN PEDRO DE CASTA"]
[null,"150725","LIMA","HUAROCHIRI","SAN PEDRO DE HUANCAYRE"]
[null,"150726","LIMA","HUAROCHIRI","SANGALLAYA"]
[null,"150727","LIMA","HUAROCHIRI","SANTA CRUZ DE COCACHACRA"]
[null,"150728","LIMA","HUAROCHIRI","SANTA EULALIA"]
[null,"150729","LIMA","HUAROCHIRI","SANTIAGO DE ANCHUCAYA"]
[null,"150730","LIMA","HUAROCHIRI","SANTIAGO DE TUNA"]
[null,"150731","LIMA","HUAROCHIRI","SANTO DOMINGO DE LOS OLLEROS"]
[null,"150732","LIMA","HUAROCHIRI","SURCO"]
[null,"150801","LIMA","HUAURA","HUACHO"]
[null,"150802","LIMA","HUAURA","AMBAR"]
[null,"150803","LIMA","HUAURA","CALETA DE CARQUIN"]
[null,"150804","LIMA","HUAURA","CHECRAS"]
[null,"150805","LIMA","HUAURA","HUALMAY"]
[null,"150806","LIMA","HUAURA","HUAURA"]
[null,"150807","LIMA","HUAURA","LEONCIO PRADO"]
[null,"150808","LIMA","HUAURA","PACCHO"]
[null,"150809","LIMA","HUAURA","SANTA LEONOR"]
[null,"150810","LIMA","HUAURA","SANTA MARIA"]
[null,"150811","LIMA","HUAURA","SAYAN"]
[null,"150812","LIMA","HUAURA","VEGUETA"]
[null,"150901","LIMA","OYON","OYON"]
[null,"150902","LIMA","OYON","ANDAJES"]
[null,"150903","LIMA","OYON","CAUJUL"]
[null,"150904","LIMA","OYON","COCHAMARCA"]
[null,"150905","LIMA","OYON","NAVAN"]
[null,"150906","LIMA","OYON","PACHANGARA"]
[null,"151001","LIMA","YAUYOS","YAUYOS"]
[null,"151002","LIMA","YAUYOS","ALIS"]
[null,"151003","LIMA","YAUYOS","ALLAUCA"]
[null,"151004","LIMA","YAUYOS","AYAVIRI"]
[null,"151005","LIMA","YAUYOS","AZANGARO"]
[null,"151006","LIMA","YAUYOS","CACRA"]
[null,"151007","LIMA","YAUYOS","CARANIA"]
[null,"151008","LIMA","YAUYOS","CATAHUASI"]
[null,"151009","LIMA","YAUYOS","CHOCOS"]
[null,"151010","LIMA","YAUYOS","COCHAS"]
[null,"151011","LIMA","YAUYOS","COLONIA"]
[null,"151012","LIMA","YAUYOS","HONGOS"]
[null,"151013","LIMA","YAUYOS","HUAMPARA"]
[null,"151014","LIMA","YAUYOS","HUANCAYA"]
[null,"151015","LIMA","YAUYOS","HUANGASCAR"]
[null,"151016","LIMA","YAUYOS","HUANTAN"]
[null,"151017","LIMA","YAUYOS","HUAÑEC"]
[null,"151018","LIMA","YAUYOS","LARAOS"]
[null,"151019","LIMA","YAUYOS","LINCHA"]
[null,"151020","LIMA","YAUYOS","MADEAN"]
[null,"151021","LIMA","YAUYOS","MIRAFLORES"]
[null,"151022","LIMA","YAUYOS","OMAS"]
[null,"151023","LIMA","YAUYOS","PUTINZA"]
[null,"151024","LIMA","YAUYOS","QUINCHES"]
[null,"151025","LIMA","YAUYOS","QUINOCAY"]
[null,"151026","LIMA","YAUYOS","SAN JOAQUIN"]
[null,"151027","LIMA","YAUYOS","SAN PEDRO DE PILAS"]
[null,"151028","LIMA","YAUYOS","TANTA"]
[null,"151029","LIMA","YAUYOS","TAURIPAMPA"]
[null,"151030","LIMA","YAUYOS","TOMAS"]
[null,"151031","LIMA","YAUYOS","TUPE"]
[null,"151032","LIMA","YAUYOS","VIÑAC"]
[null,"151033","LIMA","YAUYOS","VITIS"]
[null,"160101","LORETO","MAYNAS","IQUITOS"]
[null,"160102","LORETO","MAYNAS","ALTO NANAY"]
[null,"160103","LORETO","MAYNAS","FERNANDO LORES"]
[null,"160104","LORETO","MAYNAS","INDIANA"]
[null,"160105","LORETO","MAYNAS","LAS AMAZONAS"]
[null,"160106","LORETO","MAYNAS","MAZAN"]
[null,"160107","LORETO","MAYNAS","NAPO"]
[null,"160108","LORETO","MAYNAS","PUNCHANA"]
[null,"160110","LORETO","MAYNAS","TORRES CAUSANA"]
[null,"160112","LORETO","MAYNAS","BELEN"]
[null,"160113","LORETO","MAYNAS","SAN JUAN BAUTISTA"]
[null,"160201","LORETO","ALTO AMAZONAS","YURIMAGUAS"]
[null,"160202","LORETO","ALTO AMAZONAS","BALSAPUERTO"]
[null,"160205","LORETO","ALTO AMAZONAS","JEBEROS"]
[null,"160206","LORETO","ALTO AMAZONAS","LAGUNAS"]
[null,"160210","LORETO","ALTO AMAZONAS","SANTA CRUZ"]
[null,"160211","LORETO","ALTO AMAZONAS","TENIENTE CESAR LOPEZ ROJAS"]
[null,"160301","LORETO","LORETO","NAUTA"]
[null,"160302","LORETO","LORETO","PARINARI"]
[null,"160303","LORETO","LORETO","TIGRE"]
[null,"160304","LORETO","LORETO","TROMPETEROS"]
[null,"160305","LORETO","LORETO","URARINAS"]
[null,"160401","LORETO","MARISCAL RAMON CASTILLA","RAMON CASTILLA"]
[null,"160402","LORETO","MARISCAL RAMON CASTILLA","PEBAS"]
[null,"160403","LORETO","MARISCAL RAMON CASTILLA","YAVARI"]
[null,"160404","LORETO","MARISCAL RAMON CASTILLA","SAN PABLO"]
[null,"160501","LORETO","REQUENA","REQUENA"]
[null,"160502","LORETO","REQUENA","ALTO TAPICHE"]
[null,"160503","LORETO","REQUENA","CAPELO"]
[null,"160504","LORETO","REQUENA","EMILIO SAN MARTIN"]
[null,"160505","LORETO","REQUENA","MAQUIA"]
[null,"160506","LORETO","REQUENA","PUINAHUA"]
[null,"160507","LORETO","REQUENA","SAQUENA"]
[null,"160508","LORETO","REQUENA","SOPLIN"]
[null,"160509","LORETO","REQUENA","TAPICHE"]
[null,"160510","LORETO","REQUENA","JENARO HERRERA"]
[null,"160511","LORETO","REQUENA","YAQUERANA"]
[null,"160601","LORETO","UCAYALI","CONTAMANA"]
[null,"160602","LORETO","UCAYALI","INAHUAYA"]
[null,"160603","LORETO","UCAYALI","PADRE MARQUEZ"]
[null,"160604","LORETO","UCAYALI","PAMPA HERMOSA"]
[null,"160605","LORETO","UCAYALI","SARAYACU"]
[null,"160606","LORETO","UCAYALI","VARGAS GUERRA"]
[null,"160701","LORETO","DATEM DEL MARAÑON","BARRANCA"]
[null,"160702","LORETO","DATEM DEL MARAÑON","CAHUAPANAS"]
[null,"160703","LORETO","DATEM DEL MARAÑON","MANSERICHE"]
[null,"160704","LORETO","DATEM DEL MARAÑON","MORONA"]
[null,"160705","LORETO","DATEM DEL MARAÑON","PASTAZA"]
[null,"160706","LORETO","DATEM DEL MARAÑON","ANDOAS"]
[null,"160801","LORETO","PUTUMAYO","PUTUMAYO"]
[null,"160802","LORETO","PUTUMAYO","ROSA PANDURO"]
[null,"160803","LORETO","PUTUMAYO","TENIENTE MANUEL CLAVERO"]
[null,"160804","LORETO","PUTUMAYO","YAGUAS"]
[null,"170101","MADRE DE DIOS","TAMBOPATA","TAMBOPATA"]
[null,"170102","MADRE DE DIOS","TAMBOPATA","INAMBARI"]
[null,"170103","MADRE DE DIOS","TAMBOPATA","LAS PIEDRAS"]
[null,"170104","MADRE DE DIOS","TAMBOPATA","LABERINTO"]
[null,"170201","MADRE DE DIOS","MANU","MANU"]
[null,"170202","MADRE DE DIOS","MANU","FITZCARRALD"]
[null,"170203","MADRE DE DIOS","MANU","MADRE DE DIOS"]
[null,"170204","MADRE DE DIOS","MANU","HUEPETUHE"]
[null,"170301","MADRE DE DIOS","TAHUAMANU","IÑAPARI"]
[null,"170302","MADRE DE DIOS","TAHUAMANU","IBERIA"]
[null,"170303","MADRE DE DIOS","TAHUAMANU","TAHUAMANU"]
[null,"180101","MOQUEGUA","MARISCAL NIETO","MOQUEGUA"]
[null,"180102","MOQUEGUA","MARISCAL NIETO","CARUMAS"]
[null,"180103","MOQUEGUA","MARISCAL NIETO","CUCHUMBAYA"]
[null,"180104","MOQUEGUA","MARISCAL NIETO","SAMEGUA"]
[null,"180105","MOQUEGUA","MARISCAL NIETO","SAN CRISTOBAL"]
[null,"180106","MOQUEGUA","MARISCAL NIETO","TORATA"]
[null,"180107","MOQUEGUA","MARISCAL NIETO","SAN ANTONIO"]
[null,"180201","MOQUEGUA","GENERAL SANCHEZ CERRO","OMATE"]
[null,"180202","MOQUEGUA","GENERAL SANCHEZ CERRO","CHOJATA"]
[null,"180203","MOQUEGUA","GENERAL SANCHEZ CERRO","COALAQUE"]
[null,"180204","MOQUEGUA","GENERAL SANCHEZ CERRO","ICHUÑA"]
[null,"180205","MOQUEGUA","GENERAL SANCHEZ CERRO","LA CAPILLA"]
[null,"180206","MOQUEGUA","GENERAL SANCHEZ CERRO","LLOQUE"]
[null,"180207","MOQUEGUA","GENERAL SANCHEZ CERRO","MATALAQUE"]
[null,"180208","MOQUEGUA","GENERAL SANCHEZ CERRO","PUQUINA"]
[null,"180209","MOQUEGUA","GENERAL SANCHEZ CERRO","QUINISTAQUILLAS"]
[null,"180210","MOQUEGUA","GENERAL SANCHEZ CERRO","UBINAS"]
[null,"180211","MOQUEGUA","GENERAL SANCHEZ CERRO","YUNGA"]
[null,"180301","MOQUEGUA","ILO","ILO"]
[null,"180302","MOQUEGUA","ILO","EL ALGARROBAL"]
[null,"180303","MOQUEGUA","ILO","PACOCHA"]
[null,"190101","PASCO","PASCO","CHAUPIMARCA"]
[null,"190102","PASCO","PASCO","HUACHON"]
[null,"190103","PASCO","PASCO","HUARIACA"]
[null,"190104","PASCO","PASCO","HUAYLLAY"]
[null,"190105","PASCO","PASCO","NINACACA"]
[null,"190106","PASCO","PASCO","PALLANCHACRA"]
[null,"190107","PASCO","PASCO","PAUCARTAMBO"]
[null,"190108","PASCO","PASCO","SAN FRANCISCO DE ASIS DE YARUSYACAN"]
[null,"190109","PASCO","PASCO","SIMON BOLIVAR"]
[null,"190110","PASCO","PASCO","TICLACAYAN"]
[null,"190111","PASCO","PASCO","TINYAHUARCO"]
[null,"190112","PASCO","PASCO","VICCO"]
[null,"190113","PASCO","PASCO","YANACANCHA"]
[null,"190201","PASCO","DANIEL ALCIDES CARRION","YANAHUANCA"]
[null,"190202","PASCO","DANIEL ALCIDES CARRION","CHACAYAN"]
[null,"190203","PASCO","DANIEL ALCIDES CARRION","GOYLLARISQUIZGA"]
[null,"190204","PASCO","DANIEL ALCIDES CARRION","PAUCAR"]
[null,"190205","PASCO","DANIEL ALCIDES CARRION","SAN PEDRO DE PILLAO"]
[null,"190206","PASCO","DANIEL ALCIDES CARRION","SANTA ANA DE TUSI"]
[null,"190207","PASCO","DANIEL ALCIDES CARRION","TAPUC"]
[null,"190208","PASCO","DANIEL ALCIDES CARRION","VILCABAMBA"]
[null,"190301","PASCO","OXAPAMPA","OXAPAMPA"]
[null,"190302","PASCO","OXAPAMPA","CHONTABAMBA"]
[null,"190303","PASCO","OXAPAMPA","HUANCABAMBA"]
[null,"190304","PASCO","OXAPAMPA","PALCAZU"]
[null,"190305","PASCO","OXAPAMPA","POZUZO"]
[null,"190306","PASCO","OXAPAMPA","PUERTO BERMUDEZ"]
[null,"190307","PASCO","OXAPAMPA","VILLA RICA"]
[null,"190308","PASCO","OXAPAMPA","CONSTITUCIÓN"]
[null,"200101","PIURA","PIURA","PIURA"]
[null,"200104","PIURA","PIURA","CASTILLA"]
[null,"200105","PIURA","PIURA","CATACAOS"]
[null,"200107","PIURA","PIURA","CURA MORI"]
[null,"200108","PIURA","PIURA","EL TALLÁN"]
[null,"200109","PIURA","PIURA","LA ARENA"]
[null,"200110","PIURA","PIURA","LA UNION"]
[null,"200111","PIURA","PIURA","LAS LOMAS"]
[null,"200114","PIURA","PIURA","TAMBO GRANDE"]
[null,"200115","PIURA","PIURA","VEINTISEIS DE OCTUBRE"]
[null,"200201","PIURA","AYABACA","AYABACA"]
[null,"200202","PIURA","AYABACA","FRIAS"]
[null,"200203","PIURA","AYABACA","JILILI"]
[null,"200204","PIURA","AYABACA","LAGUNAS"]
[null,"200205","PIURA","AYABACA","MONTERO"]
[null,"200206","PIURA","AYABACA","PACAIPAMPA"]
[null,"200207","PIURA","AYABACA","PAIMAS"]
[null,"200208","PIURA","AYABACA","SAPILLICA"]
[null,"200209","PIURA","AYABACA","SICCHEZ"]
[null,"200210","PIURA","AYABACA","SUYO"]
[null,"200301","PIURA","HUANCABAMBA","HUANCABAMBA"]
[null,"200302","PIURA","HUANCABAMBA","CANCHAQUE"]
[null,"200303","PIURA","HUANCABAMBA","EL CARMEN DE LA FRONTERA"]
[null,"200304","PIURA","HUANCABAMBA","HUARMACA"]
[null,"200305","PIURA","HUANCABAMBA","LALAQUIZ"]
[null,"200306","PIURA","HUANCABAMBA","SAN MIGUEL DE EL FAIQUE"]
[null,"200307","PIURA","HUANCABAMBA","SONDOR"]
[null,"200308","PIURA","HUANCABAMBA","SONDORILLO"]
[null,"200401","PIURA","MORROPON","CHULUCANAS"]
[null,"200402","PIURA","MORROPON","BUENOS AIRES"]
[null,"200403","PIURA","MORROPON","CHALACO"]
[null,"200404","PIURA","MORROPON","LA MATANZA"]
[null,"200405","PIURA","MORROPON","MORROPON"]
[null,"200406","PIURA","MORROPON","SALITRAL"]
[null,"200407","PIURA","MORROPON","SAN JUAN DE BIGOTE"]
[null,"200408","PIURA","MORROPON","SANTA CATALINA DE MOSSA"]
[null,"200409","PIURA","MORROPON","SANTO DOMINGO"]
[null,"200410","PIURA","MORROPON","YAMANGO"]
[null,"200501","PIURA","PAITA","PAITA"]
[null,"200502","PIURA","PAITA","AMOTAPE"]
[null,"200503","PIURA","PAITA","ARENAL"]
[null,"200504","PIURA","PAITA","COLAN"]
[null,"200505","PIURA","PAITA","LA HUACA"]
[null,"200506","PIURA","PAITA","TAMARINDO"]
[null,"200507","PIURA","PAITA","VICHAYAL"]
[null,"200601","PIURA","SULLANA","SULLANA"]
[null,"200602","PIURA","SULLANA","BELLAVISTA"]
[null,"200603","PIURA","SULLANA","IGNACIO ESCUDERO"]
[null,"200604","PIURA","SULLANA","LANCONES"]
[null,"200605","PIURA","SULLANA","MARCAVELICA"]
[null,"200606","PIURA","SULLANA","MIGUEL CHECA"]
[null,"200607","PIURA","SULLANA","QUERECOTILLO"]
[null,"200608","PIURA","SULLANA","SALITRAL"]
[null,"200701","PIURA","TALARA","PARIÑAS"]
[null,"200702","PIURA","TALARA","EL ALTO"]
[null,"200703","PIURA","TALARA","LA BREA"]
[null,"200704","PIURA","TALARA","LOBITOS"]
[null,"200705","PIURA","TALARA","LOS ORGANOS"]
[null,"200706","PIURA","TALARA","MANCORA"]
[null,"200801","PIURA","SECHURA","SECHURA"]
[null,"200802","PIURA","SECHURA","BELLAVISTA DE LA UNION"]
[null,"200803","PIURA","SECHURA","BERNAL"]
[null,"200804","PIURA","SECHURA","CRISTO NOS VALGA"]
[null,"200805","PIURA","SECHURA","VICE"]
[null,"200806","PIURA","SECHURA","RINCONADA LLICUAR"]
[null,"210101","PUNO","PUNO","PUNO"]
[null,"210102","PUNO","PUNO","ACORA"]
[null,"210103","PUNO","PUNO","AMANTANI"]
[null,"210104","PUNO","PUNO","ATUNCOLLA"]
[null,"210105","PUNO","PUNO","CAPACHICA"]
[null,"210106","PUNO","PUNO","CHUCUITO"]
[null,"210107","PUNO","PUNO","COATA"]
[null,"210108","PUNO","PUNO","HUATA"]
[null,"210109","PUNO","PUNO","MAÑAZO"]
[null,"210110","PUNO","PUNO","PAUCARCOLLA"]
[null,"210111","PUNO","PUNO","PICHACANI"]
[null,"210112","PUNO","PUNO","PLATERIA"]
[null,"210113","PUNO","PUNO","SAN ANTONIO"]
[null,"210114","PUNO","PUNO","TIQUILLACA"]
[null,"210115","PUNO","PUNO","VILQUE"]
[null,"210201","PUNO","AZANGARO","AZANGARO"]
[null,"210202","PUNO","AZANGARO","ACHAYA"]
[null,"210203","PUNO","AZANGARO","ARAPA"]
[null,"210204","PUNO","AZANGARO","ASILLO"]
[null,"210205","PUNO","AZANGARO","CAMINACA"]
[null,"210206","PUNO","AZANGARO","CHUPA"]
[null,"210207","PUNO","AZANGARO","JOSE DOMINGO CHOQUEHUANCA"]
[null,"210208","PUNO","AZANGARO","MUÑANI"]
[null,"210209","PUNO","AZANGARO","POTONI"]
[null,"210210","PUNO","AZANGARO","SAMAN"]
[null,"210211","PUNO","AZANGARO","SAN ANTON"]
[null,"210212","PUNO","AZANGARO","SAN JOSE"]
[null,"210213","PUNO","AZANGARO","SAN JUAN DE SALINAS"]
[null,"210214","PUNO","AZANGARO","SANTIAGO DE PUPUJA"]
[null,"210215","PUNO","AZANGARO","TIRAPATA"]
[null,"210301","PUNO","CARABAYA","MACUSANI"]
[null,"210302","PUNO","CARABAYA","AJOYANI"]
[null,"210303","PUNO","CARABAYA","AYAPATA"]
[null,"210304","PUNO","CARABAYA","COASA"]
[null,"210305","PUNO","CARABAYA","CORANI"]
[null,"210306","PUNO","CARABAYA","CRUCERO"]
[null,"210307","PUNO","CARABAYA","ITUATA"]
[null,"210308","PUNO","CARABAYA","OLLACHEA"]
[null,"210309","PUNO","CARABAYA","SAN GABAN"]
[null,"210310","PUNO","CARABAYA","USICAYOS"]
[null,"210401","PUNO","CHUCUITO","JULI"]
[null,"210402","PUNO","CHUCUITO","DESAGUADERO"]
[null,"210403","PUNO","CHUCUITO","HUACULLANI"]
[null,"210404","PUNO","CHUCUITO","KELLUYO"]
[null,"210405","PUNO","CHUCUITO","PISACOMA"]
[null,"210406","PUNO","CHUCUITO","POMATA"]
[null,"210407","PUNO","CHUCUITO","ZEPITA"]
[null,"210501","PUNO","EL COLLAO","ILAVE"]
[null,"210502","PUNO","EL COLLAO","CAPAZO"]
[null,"210503","PUNO","EL COLLAO","PILCUYO"]
[null,"210504","PUNO","EL COLLAO","SANTA ROSA"]
[null,"210505","PUNO","EL COLLAO","CONDURIRI"]
[null,"210601","PUNO","HUANCANE","HUANCANE"]
[null,"210602","PUNO","HUANCANE","COJATA"]
[null,"210603","PUNO","HUANCANE","HUATASANI"]
[null,"210604","PUNO","HUANCANE","INCHUPALLA"]
[null,"210605","PUNO","HUANCANE","PUSI"]
[null,"210606","PUNO","HUANCANE","ROSASPATA"]
[null,"210607","PUNO","HUANCANE","TARACO"]
[null,"210608","PUNO","HUANCANE","VILQUE CHICO"]
[null,"210701","PUNO","LAMPA","LAMPA"]
[null,"210702","PUNO","LAMPA","CABANILLA"]
[null,"210703","PUNO","LAMPA","CALAPUJA"]
[null,"210704","PUNO","LAMPA","NICASIO"]
[null,"210705","PUNO","LAMPA","OCUVIRI"]
[null,"210706","PUNO","LAMPA","PALCA"]
[null,"210707","PUNO","LAMPA","PARATIA"]
[null,"210708","PUNO","LAMPA","PUCARA"]
[null,"210709","PUNO","LAMPA","SANTA LUCIA"]
[null,"210710","PUNO","LAMPA","VILAVILA"]
[null,"210801","PUNO","MELGAR","AYAVIRI"]
[null,"210802","PUNO","MELGAR","ANTAUTA"]
[null,"210803","PUNO","MELGAR","CUPI"]
[null,"210804","PUNO","MELGAR","LLALLI"]
[null,"210805","PUNO","MELGAR","MACARI"]
[null,"210806","PUNO","MELGAR","NUÑOA"]
[null,"210807","PUNO","MELGAR","ORURILLO"]
[null,"210808","PUNO","MELGAR","SANTA ROSA"]
[null,"210809","PUNO","MELGAR","UMACHIRI"]
[null,"210901","PUNO","MOHO","MOHO"]
[null,"210902","PUNO","MOHO","CONIMA"]
[null,"210903","PUNO","MOHO","HUAYRAPATA"]
[null,"210904","PUNO","MOHO","TILALI"]
[null,"211001","PUNO","SAN ANTONIO DE PUTINA","PUTINA"]
[null,"211002","PUNO","SAN ANTONIO DE PUTINA","ANANEA"]
[null,"211003","PUNO","SAN ANTONIO DE PUTINA","PEDRO VILCA APAZA"]
[null,"211004","PUNO","SAN ANTONIO DE PUTINA","QUILCAPUNCU"]
[null,"211005","PUNO","SAN ANTONIO DE PUTINA","SINA"]
[null,"211101","PUNO","SAN ROMAN","JULIACA"]
[null,"211102","PUNO","SAN ROMAN","CABANA"]
[null,"211103","PUNO","SAN ROMAN","CABANILLAS"]
[null,"211104","PUNO","SAN ROMAN","CARACOTO"]
[null,"211105","PUNO","SAN ROMAN","SAN MIGUEL"]
[null,"211201","PUNO","SANDIA","SANDIA"]
[null,"211202","PUNO","SANDIA","CUYOCUYO"]
[null,"211203","PUNO","SANDIA","LIMBANI"]
[null,"211204","PUNO","SANDIA","PATAMBUCO"]
[null,"211205","PUNO","SANDIA","PHARA"]
[null,"211206","PUNO","SANDIA","QUIACA"]
[null,"211207","PUNO","SANDIA","SAN JUAN DEL ORO"]
[null,"211208","PUNO","SANDIA","YANAHUAYA"]
[null,"211209","PUNO","SANDIA","ALTO INAMBARI"]
[null,"211210","PUNO","SANDIA","SAN PEDRO DE PUTINA PUNCO"]
[null,"211301","PUNO","YUNGUYO","YUNGUYO"]
[null,"211302","PUNO","YUNGUYO","ANAPIA"]
[null,"211303","PUNO","YUNGUYO","COPANI"]
[null,"211304","PUNO","YUNGUYO","CUTURAPI"]
[null,"211305","PUNO","YUNGUYO","OLLARAYA"]
[null,"211306","PUNO","YUNGUYO","TINICACHI"]
[null,"211307","PUNO","YUNGUYO","UNICACHI"]
[null,"220101","SAN MARTIN","MOYOBAMBA","MOYOBAMBA"]
[null,"220102","SAN MARTIN","MOYOBAMBA","CALZADA"]
[null,"220103","SAN MARTIN","MOYOBAMBA","HABANA"]
[null,"220104","SAN MARTIN","MOYOBAMBA","JEPELACIO"]
[null,"220105","SAN MARTIN","MOYOBAMBA","SORITOR"]
[null,"220106","SAN MARTIN","MOYOBAMBA","YANTALO"]
[null,"220201","SAN MARTIN","BELLAVISTA","BELLAVISTA"]
[null,"220202","SAN MARTIN","BELLAVISTA","ALTO BIAVO"]
[null,"220203","SAN MARTIN","BELLAVISTA","BAJO BIAVO"]
[null,"220204","SAN MARTIN","BELLAVISTA","HUALLAGA"]
[null,"220205","SAN MARTIN","BELLAVISTA","SAN PABLO"]
[null,"220206","SAN MARTIN","BELLAVISTA","SAN RAFAEL"]
[null,"220301","SAN MARTIN","EL DORADO","SAN JOSE DE SISA"]
[null,"220302","SAN MARTIN","EL DORADO","AGUA BLANCA"]
[null,"220303","SAN MARTIN","EL DORADO","SAN MARTIN"]
[null,"220304","SAN MARTIN","EL DORADO","SANTA ROSA"]
[null,"220305","SAN MARTIN","EL DORADO","SHATOJA"]
[null,"220401","SAN MARTIN","HUALLAGA","SAPOSOA"]
[null,"220402","SAN MARTIN","HUALLAGA","ALTO SAPOSOA"]
[null,"220403","SAN MARTIN","HUALLAGA","EL ESLABON"]
[null,"220404","SAN MARTIN","HUALLAGA","PISCOYACU"]
[null,"220405","SAN MARTIN","HUALLAGA","SACANCHE"]
[null,"220406","SAN MARTIN","HUALLAGA","TINGO DE SAPOSOA"]
[null,"220501","SAN MARTIN","LAMAS","LAMAS"]
[null,"220502","SAN MARTIN","LAMAS","ALONSO DE ALVARADO"]
[null,"220503","SAN MARTIN","LAMAS","BARRANQUITA"]
[null,"220504","SAN MARTIN","LAMAS","CAYNARACHI"]
[null,"220505","SAN MARTIN","LAMAS","CUÑUMBUQUI"]
[null,"220506","SAN MARTIN","LAMAS","PINTO RECODO"]
[null,"220507","SAN MARTIN","LAMAS","RUMISAPA"]
[null,"220508","SAN MARTIN","LAMAS","SAN ROQUE DE CUMBAZA"]
[null,"220509","SAN MARTIN","LAMAS","SHANAO"]
[null,"220510","SAN MARTIN","LAMAS","TABALOSOS"]
[null,"220511","SAN MARTIN","LAMAS","ZAPATERO"]
[null,"220601","SAN MARTIN","MARISCAL CACERES","JUANJUI"]
[null,"220602","SAN MARTIN","MARISCAL CACERES","CAMPANILLA"]
[null,"220603","SAN MARTIN","MARISCAL CACERES","HUICUNGO"]
[null,"220604","SAN MARTIN","MARISCAL CACERES","PACHIZA"]
[null,"220605","SAN MARTIN","MARISCAL CACERES","PAJARILLO"]
[null,"220701","SAN MARTIN","PICOTA","PICOTA"]
[null,"220702","SAN MARTIN","PICOTA","BUENOS AIRES"]
[null,"220703","SAN MARTIN","PICOTA","CASPISAPA"]
[null,"220704","SAN MARTIN","PICOTA","PILLUANA"]
[null,"220705","SAN MARTIN","PICOTA","PUCACACA"]
[null,"220706","SAN MARTIN","PICOTA","SAN CRISTOBAL"]
[null,"220707","SAN MARTIN","PICOTA","SAN HILARION"]
[null,"220708","SAN MARTIN","PICOTA","SHAMBOYACU"]
[null,"220709","SAN MARTIN","PICOTA","TINGO DE PONASA"]
[null,"220710","SAN MARTIN","PICOTA","TRES UNIDOS"]
[null,"220801","SAN MARTIN","RIOJA","RIOJA"]
[null,"220802","SAN MARTIN","RIOJA","AWAJUN"]
[null,"220803","SAN MARTIN","RIOJA","ELIAS SOPLIN VARGAS"]
[null,"220804","SAN MARTIN","RIOJA","NUEVA CAJAMARCA"]
[null,"220805","SAN MARTIN","RIOJA","PARDO MIGUEL"]
[null,"220806","SAN MARTIN","RIOJA","POSIC"]
[null,"220807","SAN MARTIN","RIOJA","SAN FERNANDO"]
[null,"220808","SAN MARTIN","RIOJA","YORONGOS"]
[null,"220809","SAN MARTIN","RIOJA","YURACYACU"]
[null,"220901","SAN MARTIN","SAN MARTIN","TARAPOTO"]
[null,"220902","SAN MARTIN","SAN MARTIN","ALBERTO LEVEAU"]
[null,"220903","SAN MARTIN","SAN MARTIN","CACATACHI"]
[null,"220904","SAN MARTIN","SAN MARTIN","CHAZUTA"]
[null,"220905","SAN MARTIN","SAN MARTIN","CHIPURANA"]
[null,"220906","SAN MARTIN","SAN MARTIN","EL PORVENIR"]
[null,"220907","SAN MARTIN","SAN MARTIN","HUIMBAYOC"]
[null,"220908","SAN MARTIN","SAN MARTIN","JUAN GUERRA"]
[null,"220909","SAN MARTIN","SAN MARTIN","LA BANDA DE SHILCAYO"]
[null,"220910","SAN MARTIN","SAN MARTIN","MORALES"]
[null,"220911","SAN MARTIN","SAN MARTIN","PAPAPLAYA"]
[null,"220912","SAN MARTIN","SAN MARTIN","SAN ANTONIO"]
[null,"220913","SAN MARTIN","SAN MARTIN","SAUCE"]
[null,"220914","SAN MARTIN","SAN MARTIN","SHAPAJA"]
[null,"221001","SAN MARTIN","TOCACHE","TOCACHE"]
[null,"221002","SAN MARTIN","TOCACHE","NUEVO PROGRESO"]
[null,"221003","SAN MARTIN","TOCACHE","POLVORA"]
[null,"221004","SAN MARTIN","TOCACHE","SHUNTE"]
[null,"221005","SAN MARTIN","TOCACHE","UCHIZA"]
[null,"221006","SAN MARTIN","TOCACHE","SANTA LUCIA"]
[null,"230101","TACNA","TACNA","TACNA"]
[null,"230102","TACNA","TACNA","ALTO DE LA ALIANZA"]
[null,"230103","TACNA","TACNA","CALANA"]
[null,"230104","TACNA","TACNA","CIUDAD NUEVA"]
[null,"230105","TACNA","TACNA","INCLAN"]
[null,"230106","TACNA","TACNA","PACHIA"]
[null,"230107","TACNA","TACNA","PALCA"]
[null,"230108","TACNA","TACNA","POCOLLAY"]
[null,"230109","TACNA","TACNA","SAMA"]
[null,"230110","TACNA","TACNA","CORONEL GREGORIO ALBARRACIN LANCHIPA"]
[null,"230111","TACNA","TACNA","LA YARADA LOS PALOS"]
[null,"230201","TACNA","CANDARAVE","CANDARAVE"]
[null,"230202","TACNA","CANDARAVE","CAIRANI"]
[null,"230203","TACNA","CANDARAVE","CAMILACA"]
[null,"230204","TACNA","CANDARAVE","CURIBAYA"]
[null,"230205","TACNA","CANDARAVE","HUANUARA"]
[null,"230206","TACNA","CANDARAVE","QUILAHUANI"]
[null,"230301","TACNA","JORGE BASADRE","LOCUMBA"]
[null,"230302","TACNA","JORGE BASADRE","ILABAYA"]
[null,"230303","TACNA","JORGE BASADRE","ITE"]
[null,"230401","TACNA","TARATA","TARATA"]
[null,"230402","TACNA","TARATA","HEROES ALBARRACIN"]
[null,"230403","TACNA","TARATA","ESTIQUE"]
[null,"230404","TACNA","TARATA","ESTIQUE-PAMPA"]
[null,"230405","TACNA","TARATA","SITAJARA"]
[null,"230406","TACNA","TARATA","SUSAPAYA"]
[null,"230407","TACNA","TARATA","TARUCACHI"]
[null,"230408","TACNA","TARATA","TICACO"]
[null,"240101","TUMBES","TUMBES","TUMBES"]
[null,"240102","TUMBES","TUMBES","CORRALES"]
[null,"240103","TUMBES","TUMBES","LA CRUZ"]
[null,"240104","TUMBES","TUMBES","PAMPAS DE HOSPITAL"]
[null,"240105","TUMBES","TUMBES","SAN JACINTO"]
[null,"240106","TUMBES","TUMBES","SAN JUAN DE LA VIRGEN"]
[null,"240201","TUMBES","CONTRALMIRANTE VILLAR","ZORRITOS"]
[null,"240202","TUMBES","CONTRALMIRANTE VILLAR","CASITAS"]
[null,"240203","TUMBES","CONTRALMIRANTE VILLAR","CANOAS DE PUNTA SAL"]
[null,"240301","TUMBES","ZARUMILLA","ZARUMILLA"]
[null,"240302","TUMBES","ZARUMILLA","AGUAS VERDES"]
[null,"240303","TUMBES","ZARUMILLA","MATAPALO"]
[null,"240304","TUMBES","ZARUMILLA","PAPAYAL"]
[null,"250101","UCAYALI","CORONEL PORTILLO","CALLERIA"]
[null,"250102","UCAYALI","CORONEL PORTILLO","CAMPOVERDE"]
[null,"250103","UCAYALI","CORONEL PORTILLO","IPARIA"]
[null,"250104","UCAYALI","CORONEL PORTILLO","MASISEA"]
[null,"250105","UCAYALI","CORONEL PORTILLO","YARINACOCHA"]
[null,"250106","UCAYALI","CORONEL PORTILLO","NUEVA REQUENA"]
[null,"250107","UCAYALI","CORONEL PORTILLO","MANANTAY"]
[null,"250201","UCAYALI","ATALAYA","RAYMONDI"]
[null,"250202","UCAYALI","ATALAYA","SEPAHUA"]
[null,"250203","UCAYALI","ATALAYA","TAHUANIA"]
[null,"250204","UCAYALI","ATALAYA","YURUA"]
[null,"250301","UCAYALI","PADRE ABAD","PADRE ABAD"]
[null,"250302","UCAYALI","PADRE ABAD","IRAZOLA"]
[null,"250303","UCAYALI","PADRE ABAD","CURIMANA"]
[null,"250304","UCAYALI","PADRE ABAD","NESHUYA"]
[null,"250305","UCAYALI","PADRE ABAD","ALEXANDER VON HUMBOLDT"]
[null,"250306","UCAYALI","PADRE ABAD","HUIPOCA"]
[null,"250307","UCAYALI","PADRE ABAD","BOQUERON"]
[null,"250401","UCAYALI","PURUS","PURUS"]